BDBM50055575 CHEMBL3321794
SMILES: O=C1Cc2ccccc2N1CC\C=C\CCN1CCc2ccccc2C1
InChI Key: InChIKey=ZTJGIOBVCNIDTE-OWOJBTEDSA-N
Data: 4 KI  1 IC50  1 EC50
Activity Spreadsheet -- Enzyme Inhibition Constant Data from BindingDB
Found 6 hits for monomerid = 50055575
Trg + Lig
Ki
nM
ΔG°
kcal/mole
IC50
nM
Kd
nM
EC50/IC50
nM
koff
s-1
kon
M-1s-1
pHTemp
°C
5-hydroxytryptamine receptor 7
(Homo sapiens (Human))
BDBM50055575
(CHEMBL3321794)
Show SMILES O=C1Cc2ccccc2N1CC\C=C\CCN1CCc2ccccc2C1
Show InChI InChI=1S/C23H26N2O/c26-23-17-20-10-5-6-12-22(20)25(23)15-8-2-1-7-14-24-16-13-19-9-3-4-11-21(19)18-24/h1-6,9-12H,7-8,13-18H2/b2-1+
Reactome pathway
0.700n/an/an/an/an/an/an/an/a
Universidad Complutense de Madrid
Curated by ChEMBL
Assay Description
Displacement of [3H]LSD from human 5-HT7 expressed in HEK-293 cells after 120 mins by scintillation spectrometry
J Med Chem 57: 6879-84 (2014)
Article DOI: 10.1021/jm500880c
BindingDB Entry DOI: 10.7270/Q2J104TB
5-hydroxytryptamine receptor 7
(Homo sapiens (Human))
BDBM50055575
(CHEMBL3321794)
Show SMILES O=C1Cc2ccccc2N1CC\C=C\CCN1CCc2ccccc2C1
Show InChI InChI=1S/C23H26N2O/c26-23-17-20-10-5-6-12-22(20)25(23)15-8-2-1-7-14-24-16-13-19-9-3-4-11-21(19)18-24/h1-6,9-12H,7-8,13-18H2/b2-1+
Reactome pathway
0.700n/an/an/an/an/an/an/an/a
Normandie Univ
Curated by ChEMBL
Assay Description
Antagonist activity at 5-HT7 receptor (unknown origin)
Eur J Med Chem 183: (2019)
Article DOI: 10.1016/j.ejmech.2019.111705
5-hydroxytryptamine receptor 1A
(Homo sapiens (Human))
BDBM50055575
(CHEMBL3321794)
Show SMILES O=C1Cc2ccccc2N1CC\C=C\CCN1CCc2ccccc2C1
Show InChI InChI=1S/C23H26N2O/c26-23-17-20-10-5-6-12-22(20)25(23)15-8-2-1-7-14-24-16-13-19-9-3-4-11-21(19)18-24/h1-6,9-12H,7-8,13-18H2/b2-1+
>1.00E+3n/an/an/an/an/an/an/an/a
Normandie Univ
Curated by ChEMBL
Assay Description
Antagonist activity at 5-HT1A receptor (unknown origin)
Eur J Med Chem 183: (2019)
Article DOI: 10.1016/j.ejmech.2019.111705
5-hydroxytryptamine receptor 1A
(Homo sapiens (Human))
BDBM50055575
(CHEMBL3321794)
Show SMILES O=C1Cc2ccccc2N1CC\C=C\CCN1CCc2ccccc2C1
Show InChI InChI=1S/C23H26N2O/c26-23-17-20-10-5-6-12-22(20)25(23)15-8-2-1-7-14-24-16-13-19-9-3-4-11-21(19)18-24/h1-6,9-12H,7-8,13-18H2/b2-1+
>1.00E+3n/an/an/an/an/an/an/an/a
Universidad Complutense de Madrid
Curated by ChEMBL
Assay Description
Displacement of [3H]-8-OH-DPAT from human 5-HT1A expressed in CHO-K1 cells after 120 mins by scintillation spectrometry
J Med Chem 57: 6879-84 (2014)
Article DOI: 10.1021/jm500880c
BindingDB Entry DOI: 10.7270/Q2J104TB
5-hydroxytryptamine receptor 7
(Homo sapiens (Human))
BDBM50055575
(CHEMBL3321794)
Show SMILES O=C1Cc2ccccc2N1CC\C=C\CCN1CCc2ccccc2C1
Show InChI InChI=1S/C23H26N2O/c26-23-17-20-10-5-6-12-22(20)25(23)15-8-2-1-7-14-24-16-13-19-9-3-4-11-21(19)18-24/h1-6,9-12H,7-8,13-18H2/b2-1+
Reactome pathway
n/an/a 2.20E+3n/an/an/an/an/an/a
Universidad Complutense de Madrid
Curated by ChEMBL
Assay Description
Antagonist activity at human 5-HT7 expressed in HEK-293 cells assessed as inhibition in serotonin-induced increase in cAMP level after 45 mins by HTR...
J Med Chem 57: 6879-84 (2014)
Article DOI: 10.1021/jm500880c
BindingDB Entry DOI: 10.7270/Q2J104TB
5-hydroxytryptamine receptor 7
(Homo sapiens (Human))
BDBM50055575
(CHEMBL3321794)
Show SMILES O=C1Cc2ccccc2N1CC\C=C\CCN1CCc2ccccc2C1
Show InChI InChI=1S/C23H26N2O/c26-23-17-20-10-5-6-12-22(20)25(23)15-8-2-1-7-14-24-16-13-19-9-3-4-11-21(19)18-24/h1-6,9-12H,7-8,13-18H2/b2-1+
Reactome pathway
n/an/an/an/a 230n/an/an/an/a
Universidad Complutense de Madrid
Curated by ChEMBL
Assay Description
Agonist activity at human 5-HT7 expressed in HEK-293 cells assessed as increase in cAMP level after 45 mins by HTRF assay
J Med Chem 57: 6879-84 (2014)
Article DOI: 10.1021/jm500880c
BindingDB Entry DOI: 10.7270/Q2J104TB