BDBM50055613 CHEMBL436158::[(R)-1-((R)-1-{(R)-2-Benzyloxy-1-[(R)-1-((S)-1-carbamoyl-ethylcarbamoyl)-2-(1H-indol-3-yl)-ethylcarbamoyl]-ethylcarbamoyl}-3-phenyl-propylcarbamoyl)-2-(1H-imidazol-4-yl)-ethyl]-carbamic acid benzyl ester
SMILES: C[C@H](NC(=O)[C@@H](Cc1c[nH]c2ccccc12)NC(=O)[C@@H](COCc1ccccc1)NC(=O)[C@@H](CCc1ccccc1)NC(=O)[C@@H](Cc1cnc[nH]1)NC(=O)OCc1ccccc1)C(N)=O
InChI Key: InChIKey=UOMYCWQQWMTPFI-HXSCCUKKSA-N
Data: 1 IC50
Activity Spreadsheet -- Enzyme Inhibition Constant Data from BindingDB
Found 1 hit for monomerid = 50055613
Trg + Lig
Ki
nM
ΔG°
kcal/mole
IC50
nM
Kd
nM
EC50/IC50
nM
koff
s-1
kon
M-1s-1
pHTemp
°C
Protein Farnesyltransferase (PFT)/farnesyltransferase beta subunit
(Rattus norvegicus-Rattus norvegicus (rat))
BDBM50055613
(CHEMBL436158 | [(R)-1-((R)-1-{(R)-2-Benzyloxy-1-[(...)
Show SMILES C[C@H](NC(=O)[C@@H](Cc1c[nH]c2ccccc12)NC(=O)[C@@H](COCc1ccccc1)NC(=O)[C@@H](CCc1ccccc1)NC(=O)[C@@H](Cc1cnc[nH]1)NC(=O)OCc1ccccc1)C(N)=O
Show InChI InChI=1S/C48H53N9O8/c1-31(43(49)58)53-45(60)40(23-35-25-51-38-20-12-11-19-37(35)38)55-47(62)42(29-64-27-33-15-7-3-8-16-33)56-44(59)39(22-21-32-13-5-2-6-14-32)54-46(61)41(24-36-26-50-30-52-36)57-48(63)65-28-34-17-9-4-10-18-34/h2-20,25-26,30-31,39-42,51H,21-24,27-29H2,1H3,(H2,49,58)(H,50,52)(H,53,60)(H,54,61)(H,55,62)(H,56,59)(H,57,63)/t31-,39+,40+,41+,42+/m0/s1
n/an/a 18n/an/an/an/an/an/a
Warner-Lambert Company
Curated by ChEMBL
Assay Description
Inhibitory concentration against rat brain farnesyltransferase
J Med Chem 40: 192-200 (1997)
Article DOI: 10.1021/jm960602m
BindingDB Entry DOI: 10.7270/Q2JW8FJ4