BDBM50055682 4-(2-Carboxy-6-hydroxy-benzoyl)-3,5-dihydroxy-benzoic acid (1R,2R)-2-(4-hydroxy-benzoylamino)-4-isopropyl-cyclopentyl ester::CHEMBL76920
SMILES: CC(C)C1C[C@@H](NC(=O)c2ccc(O)cc2)[C@@H](C1)OC(=O)c1cc(O)c(C(=O)c2c(O)cccc2C(O)=O)c(O)c1
InChI Key: InChIKey=IVGCXWIFBNPPBW-AGQSAPNSSA-N
Data: 8 IC50
Activity Spreadsheet -- Enzyme Inhibition Constant Data from BindingDB
Found 8 hits for monomerid = 50055682
Trg + Lig
Ki
nM
ΔG°
kcal/mole
IC50
nM
Kd
nM
EC50/IC50
nM
koff
s-1
kon
M-1s-1
pHTemp
°C
Protein kinase C alpha type
(Homo sapiens (Human))
BDBM50055682
(4-(2-Carboxy-6-hydroxy-benzoyl)-3,5-dihydroxy-benz...)
Show SMILES CC(C)C1C[C@@H](NC(=O)c2ccc(O)cc2)[C@@H](C1)OC(=O)c1cc(O)c(C(=O)c2c(O)cccc2C(O)=O)c(O)c1
Show InChI InChI=1S/C30H29NO10/c1-14(2)16-10-20(31-28(37)15-6-8-18(32)9-7-15)24(13-16)41-30(40)17-11-22(34)26(23(35)12-17)27(36)25-19(29(38)39)4-3-5-21(25)33/h3-9,11-12,14,16,20,24,32-35H,10,13H2,1-2H3,(H,31,37)(H,38,39)/t16?,20-,24-/m1/s1
NCI pathway
Reactome pathway
n/an/a 240n/an/an/an/an/an/a
A Division of Eli Lilly & Company
Curated by ChEMBL
Assay Description
Inhibitory concentration against recombinant human Protein kinase C alpha isozyme
J Med Chem 40: 226-35 (1997)
Article DOI: 10.1021/jm960497g
BindingDB Entry DOI: 10.7270/Q2J965HR
PKC alpha and beta-2
(Homo sapiens (Human))
BDBM50055682
(4-(2-Carboxy-6-hydroxy-benzoyl)-3,5-dihydroxy-benz...)
Show SMILES CC(C)C1C[C@@H](NC(=O)c2ccc(O)cc2)[C@@H](C1)OC(=O)c1cc(O)c(C(=O)c2c(O)cccc2C(O)=O)c(O)c1
Show InChI InChI=1S/C30H29NO10/c1-14(2)16-10-20(31-28(37)15-6-8-18(32)9-7-15)24(13-16)41-30(40)17-11-22(34)26(23(35)12-17)27(36)25-19(29(38)39)4-3-5-21(25)33/h3-9,11-12,14,16,20,24,32-35H,10,13H2,1-2H3,(H,31,37)(H,38,39)/t16?,20-,24-/m1/s1
NCI pathway
Reactome pathway
n/an/a 60n/an/an/an/an/an/a
A Division of Eli Lilly & Company
Curated by ChEMBL
Assay Description
Inhibitory concentration against recombinant human Protein kinase C beta 1 isozyme
J Med Chem 40: 226-35 (1997)
Article DOI: 10.1021/jm960497g
BindingDB Entry DOI: 10.7270/Q2J965HR
Protein kinase C, eta
(Homo sapiens (Human))
BDBM50055682
(4-(2-Carboxy-6-hydroxy-benzoyl)-3,5-dihydroxy-benz...)
Show SMILES CC(C)C1C[C@@H](NC(=O)c2ccc(O)cc2)[C@@H](C1)OC(=O)c1cc(O)c(C(=O)c2c(O)cccc2C(O)=O)c(O)c1
Show InChI InChI=1S/C30H29NO10/c1-14(2)16-10-20(31-28(37)15-6-8-18(32)9-7-15)24(13-16)41-30(40)17-11-22(34)26(23(35)12-17)27(36)25-19(29(38)39)4-3-5-21(25)33/h3-9,11-12,14,16,20,24,32-35H,10,13H2,1-2H3,(H,31,37)(H,38,39)/t16?,20-,24-/m1/s1
NCI pathway
Reactome pathway
n/an/a 4n/an/an/an/an/an/a
A Division of Eli Lilly & Company
Curated by ChEMBL
Assay Description
Inhibitory concentration against recombinant human Protein kinase C eta isozyme
J Med Chem 40: 226-35 (1997)
Article DOI: 10.1021/jm960497g
BindingDB Entry DOI: 10.7270/Q2J965HR
Protein kinase C, gamma
(Homo sapiens (Human))
BDBM50055682
(4-(2-Carboxy-6-hydroxy-benzoyl)-3,5-dihydroxy-benz...)
Show SMILES CC(C)C1C[C@@H](NC(=O)c2ccc(O)cc2)[C@@H](C1)OC(=O)c1cc(O)c(C(=O)c2c(O)cccc2C(O)=O)c(O)c1
Show InChI InChI=1S/C30H29NO10/c1-14(2)16-10-20(31-28(37)15-6-8-18(32)9-7-15)24(13-16)41-30(40)17-11-22(34)26(23(35)12-17)27(36)25-19(29(38)39)4-3-5-21(25)33/h3-9,11-12,14,16,20,24,32-35H,10,13H2,1-2H3,(H,31,37)(H,38,39)/t16?,20-,24-/m1/s1
NCI pathway
Reactome pathway
n/an/a 90n/an/an/an/an/an/a
A Division of Eli Lilly & Company
Curated by ChEMBL
Assay Description
Inhibitory concentration against recombinant human Protein kinase C gamma isozyme
J Med Chem 40: 226-35 (1997)
Article DOI: 10.1021/jm960497g
BindingDB Entry DOI: 10.7270/Q2J965HR
Protein kinase C delta type
(Homo sapiens (Human))
BDBM50055682
(4-(2-Carboxy-6-hydroxy-benzoyl)-3,5-dihydroxy-benz...)
Show SMILES CC(C)C1C[C@@H](NC(=O)c2ccc(O)cc2)[C@@H](C1)OC(=O)c1cc(O)c(C(=O)c2c(O)cccc2C(O)=O)c(O)c1
Show InChI InChI=1S/C30H29NO10/c1-14(2)16-10-20(31-28(37)15-6-8-18(32)9-7-15)24(13-16)41-30(40)17-11-22(34)26(23(35)12-17)27(36)25-19(29(38)39)4-3-5-21(25)33/h3-9,11-12,14,16,20,24,32-35H,10,13H2,1-2H3,(H,31,37)(H,38,39)/t16?,20-,24-/m1/s1
NCI pathway
Reactome pathway
n/an/a 40n/an/an/an/an/an/a
A Division of Eli Lilly & Company
Curated by ChEMBL
Assay Description
Inhibitory concentration against recombinant human Protein kinase C delta isozyme
J Med Chem 40: 226-35 (1997)
Article DOI: 10.1021/jm960497g
BindingDB Entry DOI: 10.7270/Q2J965HR
Protein kinase C (PKC)
(Homo sapiens (Human))
BDBM50055682
(4-(2-Carboxy-6-hydroxy-benzoyl)-3,5-dihydroxy-benz...)
Show SMILES CC(C)C1C[C@@H](NC(=O)c2ccc(O)cc2)[C@@H](C1)OC(=O)c1cc(O)c(C(=O)c2c(O)cccc2C(O)=O)c(O)c1
Show InChI InChI=1S/C30H29NO10/c1-14(2)16-10-20(31-28(37)15-6-8-18(32)9-7-15)24(13-16)41-30(40)17-11-22(34)26(23(35)12-17)27(36)25-19(29(38)39)4-3-5-21(25)33/h3-9,11-12,14,16,20,24,32-35H,10,13H2,1-2H3,(H,31,37)(H,38,39)/t16?,20-,24-/m1/s1
NCI pathway
Reactome pathway
n/an/a 3.70E+4n/an/an/an/an/an/a
A Division of Eli Lilly & Company
Curated by ChEMBL
Assay Description
Inhibitory concentration against recombinant human Protein kinase C zeta isozyme
J Med Chem 40: 226-35 (1997)
Article DOI: 10.1021/jm960497g
BindingDB Entry DOI: 10.7270/Q2J965HR
Protein kinase C, epsilon
(Homo sapiens (Human))
BDBM50055682
(4-(2-Carboxy-6-hydroxy-benzoyl)-3,5-dihydroxy-benz...)
Show SMILES CC(C)C1C[C@@H](NC(=O)c2ccc(O)cc2)[C@@H](C1)OC(=O)c1cc(O)c(C(=O)c2c(O)cccc2C(O)=O)c(O)c1
Show InChI InChI=1S/C30H29NO10/c1-14(2)16-10-20(31-28(37)15-6-8-18(32)9-7-15)24(13-16)41-30(40)17-11-22(34)26(23(35)12-17)27(36)25-19(29(38)39)4-3-5-21(25)33/h3-9,11-12,14,16,20,24,32-35H,10,13H2,1-2H3,(H,31,37)(H,38,39)/t16?,20-,24-/m1/s1
NCI pathway
Reactome pathway
n/an/a 50n/an/an/an/an/an/a
A Division of Eli Lilly & Company
Curated by ChEMBL
Assay Description
Inhibitory concentration against recombinant human Protein kinase C epsilon isozyme
J Med Chem 40: 226-35 (1997)
Article DOI: 10.1021/jm960497g
BindingDB Entry DOI: 10.7270/Q2J965HR
PKC alpha and beta-2
(Homo sapiens (Human))
BDBM50055682
(4-(2-Carboxy-6-hydroxy-benzoyl)-3,5-dihydroxy-benz...)
Show SMILES CC(C)C1C[C@@H](NC(=O)c2ccc(O)cc2)[C@@H](C1)OC(=O)c1cc(O)c(C(=O)c2c(O)cccc2C(O)=O)c(O)c1
Show InChI InChI=1S/C30H29NO10/c1-14(2)16-10-20(31-28(37)15-6-8-18(32)9-7-15)24(13-16)41-30(40)17-11-22(34)26(23(35)12-17)27(36)25-19(29(38)39)4-3-5-21(25)33/h3-9,11-12,14,16,20,24,32-35H,10,13H2,1-2H3,(H,31,37)(H,38,39)/t16?,20-,24-/m1/s1
NCI pathway
Reactome pathway
n/an/a 70n/an/an/an/an/an/a
A Division of Eli Lilly & Company
Curated by ChEMBL
Assay Description
Inhibitory concentration against recombinant human Protein kinase C beta 2 isozyme
J Med Chem 40: 226-35 (1997)
Article DOI: 10.1021/jm960497g
BindingDB Entry DOI: 10.7270/Q2J965HR