BDBM50055706 4-hydroxy-3-[4-hydroxy-2-oxo-2H-3-chromenyl(3-quinolyl)methyl]-2H-2-chromenone::CHEMBL81144
SMILES: Oc1c(C(c2cnc3ccccc3c2)c2c(O)c3ccccc3oc2=O)c(=O)oc2ccccc12
InChI Key: InChIKey=OATUCGPJXJOYHJ-UHFFFAOYSA-N
Data: 4 IC50
Activity Spreadsheet -- Enzyme Inhibition Constant Data from BindingDB
Found 4 hits for monomerid = 50055706
Trg + Lig
Ki
nM
ΔG°
kcal/mole
IC50
nM
Kd
nM
EC50/IC50
nM
koff
s-1
kon
M-1s-1
pHTemp
°C
Human immunodeficiency virus type 1 integrase
(Human immunodeficiency virus 1)
BDBM50055706
(4-hydroxy-3-[4-hydroxy-2-oxo-2H-3-chromenyl(3-quin...)
Show SMILES Oc1c(C(c2cnc3ccccc3c2)c2c(O)c3ccccc3oc2=O)c(=O)oc2ccccc12
Show InChI InChI=1S/C28H17NO6/c30-25-17-8-2-5-11-20(17)34-27(32)23(25)22(16-13-15-7-1-4-10-19(15)29-14-16)24-26(31)18-9-3-6-12-21(18)35-28(24)33/h1-14,22,30-31H
n/an/a 3.50E+4n/an/an/an/an/an/a
National Cancer Institute
Curated by ChEMBL
Assay Description
Inhibitory activity against 3'-processing of DNA by HIV-1 integrase
J Med Chem 40: 242-9 (1997)
Article DOI: 10.1021/jm960450v
BindingDB Entry DOI: 10.7270/Q2DN444V
NAD(P)H dehydrogenase [quinone] 1
(Homo sapiens (Human))
BDBM50055706
(4-hydroxy-3-[4-hydroxy-2-oxo-2H-3-chromenyl(3-quin...)
Show SMILES Oc1c(C(c2cnc3ccccc3c2)c2c(O)c3ccccc3oc2=O)c(=O)oc2ccccc12
Show InChI InChI=1S/C28H17NO6/c30-25-17-8-2-5-11-20(17)34-27(32)23(25)22(16-13-15-7-1-4-10-19(15)29-14-16)24-26(31)18-9-3-6-12-21(18)35-28(24)33/h1-14,22,30-31H
Reactome pathway
n/an/a 380n/an/an/an/an/an/a
University of Manchester
Curated by ChEMBL
Assay Description
Inhibition of human recombinant NQO1 in presence of BSA
J Med Chem 50: 6316-25 (2007)
Article DOI: 10.1021/jm070472p
BindingDB Entry DOI: 10.7270/Q2DV1JM1
NAD(P)H dehydrogenase [quinone] 1
(Homo sapiens (Human))
BDBM50055706
(4-hydroxy-3-[4-hydroxy-2-oxo-2H-3-chromenyl(3-quin...)
Show SMILES Oc1c(C(c2cnc3ccccc3c2)c2c(O)c3ccccc3oc2=O)c(=O)oc2ccccc12
Show InChI InChI=1S/C28H17NO6/c30-25-17-8-2-5-11-20(17)34-27(32)23(25)22(16-13-15-7-1-4-10-19(15)29-14-16)24-26(31)18-9-3-6-12-21(18)35-28(24)33/h1-14,22,30-31H
Reactome pathway
n/an/a 1.80E+4n/an/an/an/an/an/a
University of Manchester
Curated by ChEMBL
Assay Description
Inhibition of human recombinant NQO1 in presence of BSA
J Med Chem 50: 6316-25 (2007)
Article DOI: 10.1021/jm070472p
BindingDB Entry DOI: 10.7270/Q2DV1JM1
Human immunodeficiency virus type 1 integrase
(Human immunodeficiency virus 1)
BDBM50055706
(4-hydroxy-3-[4-hydroxy-2-oxo-2H-3-chromenyl(3-quin...)
Show SMILES Oc1c(C(c2cnc3ccccc3c2)c2c(O)c3ccccc3oc2=O)c(=O)oc2ccccc12
Show InChI InChI=1S/C28H17NO6/c30-25-17-8-2-5-11-20(17)34-27(32)23(25)22(16-13-15-7-1-4-10-19(15)29-14-16)24-26(31)18-9-3-6-12-21(18)35-28(24)33/h1-14,22,30-31H
n/an/a 2.30E+4n/an/an/an/an/an/a
National Cancer Institute
Curated by ChEMBL
Assay Description
Integration of DNA by HIV -1 integrase
J Med Chem 40: 242-9 (1997)
Article DOI: 10.1021/jm960450v
BindingDB Entry DOI: 10.7270/Q2DN444V