BDBM50055860 CHEMBL3329967
SMILES: OC(=O)c1cccc(NC2=CC(=O)C(Nc3cccc(c3)C(O)=O)=CC2=O)c1
InChI Key: InChIKey=NMQDJDPXNQLNKZ-UHFFFAOYSA-N
Data: 2 IC50
Activity Spreadsheet -- Enzyme Inhibition Constant Data from BindingDB
Found 2 hits for monomerid = 50055860
Trg + Lig
Ki
nM
ΔG°
kcal/mole
IC50
nM
Kd
nM
EC50/IC50
nM
koff
s-1
kon
M-1s-1
pHTemp
°C
Dynamin-1
(Homo sapiens (Human))
BDBM50055860
(CHEMBL3329967)
Show SMILES OC(=O)c1cccc(NC2=CC(=O)C(Nc3cccc(c3)C(O)=O)=CC2=O)c1 |c:24,t:9|
Show InChI InChI=1S/C20H14N2O6/c23-17-10-16(22-14-6-2-4-12(8-14)20(27)28)18(24)9-15(17)21-13-5-1-3-11(7-13)19(25)26/h1-10,21-22H,(H,25,26)(H,27,28)
NCI pathway
Reactome pathway
n/an/a>3.00E+5n/an/an/an/an/an/a
The University of Newcastle
Curated by ChEMBL
Assay Description
Inhibition of Dynamin 1 in serum-starved human U2OS cells assessed as inhibition of clathrin-mediated Alexa-495-cojugated transferrin uptake pretreat...
Eur J Med Chem 85: 191-206 (2014)
Article DOI: 10.1016/j.ejmech.2014.06.070
BindingDB Entry DOI: 10.7270/Q28G8NCR
Dynamin-2
(Rattus norvegicus)
BDBM50055860
(CHEMBL3329967)
Show SMILES OC(=O)c1cccc(NC2=CC(=O)C(Nc3cccc(c3)C(O)=O)=CC2=O)c1 |c:24,t:9|
Show InChI InChI=1S/C20H14N2O6/c23-17-10-16(22-14-6-2-4-12(8-14)20(27)28)18(24)9-15(17)21-13-5-1-3-11(7-13)19(25)26/h1-10,21-22H,(H,25,26)(H,27,28)
Reactome pathway
n/an/a 1.47E+4n/an/an/an/an/an/a
The University of Newcastle
Curated by ChEMBL
Assay Description
Inhibition of phosphatidylserine-stimulated GTPase activity of recombinant rat Dynamin 2 expressed in Sf21 cells assessed as inhibition of orthophosp...
Eur J Med Chem 85: 191-206 (2014)
Article DOI: 10.1016/j.ejmech.2014.06.070
BindingDB Entry DOI: 10.7270/Q28G8NCR