BDBM50055933 CHEMBL3321930
SMILES: COc1ccc(CC(=O)NC(=N)N[C@H](CC2CCCCC2)C(=O)NCc2ccc(F)c(F)c2)cc1OC
InChI Key: InChIKey=NRKQPMZKNGHQHZ-JOCHJYFZSA-N
Data: 1 IC50
Activity Spreadsheet -- Enzyme Inhibition Constant Data from BindingDB
Found 1 hit for monomerid = 50055933
Trg + Lig
Ki
nM
ΔG°
kcal/mole
IC50
nM
Kd
nM
EC50/IC50
nM
koff
s-1
kon
M-1s-1
pHTemp
°C
Cathepsin D
(Homo sapiens (Human))
BDBM50055933
(CHEMBL3321930)
Show SMILES COc1ccc(CC(=O)NC(=N)N[C@H](CC2CCCCC2)C(=O)NCc2ccc(F)c(F)c2)cc1OC |r|
Show InChI InChI=1S/C27H34F2N4O4/c1-36-23-11-9-18(14-24(23)37-2)15-25(34)33-27(30)32-22(13-17-6-4-3-5-7-17)26(35)31-16-19-8-10-20(28)21(29)12-19/h8-12,14,17,22H,3-7,13,15-16H2,1-2H3,(H,31,35)(H3,30,32,33,34)/t22-/m1/s1
NCI pathway
Reactome pathway
n/an/a 170n/an/an/an/an/an/a
Merck KGaA
Curated by ChEMBL
Assay Description
Inhibition of human liver cathepsin D using MCA-labeled GKPILFFRLK(Dnp)-D-R-NH2 peptide by fluorescence-based assay
Bioorg Med Chem Lett 24: 4141-50 (2014)
Article DOI: 10.1016/j.bmcl.2014.07.054
BindingDB Entry DOI: 10.7270/Q2W95BV1