BDBM50055971 CHEMBL3325696
SMILES: Cc1nn(c2CC(C)(C)CC(=O)c12)-c1ccccc1Cl
InChI Key: InChIKey=HWRQQUXYXHLFNV-UHFFFAOYSA-N
Data: 1 EC50
Activity Spreadsheet -- Enzyme Inhibition Constant Data from BindingDB
Found 1 hit for monomerid = 50055971
Trg + Lig
Ki
nM
ΔG°
kcal/mole
IC50
nM
Kd
nM
EC50/IC50
nM
koff
s-1
kon
M-1s-1
pHTemp
°C
Mu-type opioid receptor
(Homo sapiens (Human))
BDBM50055971
(CHEMBL3325696)
Show SMILES Cc1nn(c2CC(C)(C)CC(=O)c12)-c1ccccc1Cl
Show InChI InChI=1S/C16H17ClN2O/c1-10-15-13(8-16(2,3)9-14(15)20)19(18-10)12-7-5-4-6-11(12)17/h4-7H,8-9H2,1-3H3
NCI pathway
Reactome pathway
n/an/an/an/a 2.28E+3n/an/an/an/a
National Health Research Institutes
Curated by ChEMBL
Assay Description
Agonist activity at human mu opioid receptor expressed CHO-K1 cells coexpressing Galpha15 assessed as induction of intracellular calcium release by F...
Bioorg Med Chem 22: 4694-703 (2014)
Article DOI: 10.1016/j.bmc.2014.07.012
BindingDB Entry DOI: 10.7270/Q2H133NH