BDBM50056066 (2R,3R,4S)-1-Dibutylcarbamoylmethyl-4-(2,3-dihydro-benzofuran-5-yl)-2-(4-methoxy-phenyl)-pyrrolidine-3-carboxylic acid::1-Dibutylcarbamoylmethyl-4-(2,3-dihydro-benzofuran-5-yl)-2-(4-methoxy-phenyl)-pyrrolidine-3-carboxylic acid::CHEMBL110366
SMILES: CCCCN(CCCC)C(=O)CN1C[C@@H]([C@H]([C@@H]1c1ccc(OC)cc1)C(O)=O)c1ccc2OCCc2c1
InChI Key: InChIKey=VLYHLACLMBVNJD-ZJGIAAPESA-N
Data: 4 IC50
Activity Spreadsheet -- Enzyme Inhibition Constant Data from BindingDB
Found 4 hits for monomerid = 50056066
Trg + Lig
Ki
nM
ΔG°
kcal/mole
IC50
nM
Kd
nM
EC50/IC50
nM
koff
s-1
kon
M-1s-1
pHTemp
°C
Endothelin receptor ET-B
(Sus scrofa)
BDBM50056066
((2R,3R,4S)-1-Dibutylcarbamoylmethyl-4-(2,3-dihydro...)
Show SMILES CCCCN(CCCC)C(=O)CN1C[C@@H]([C@H]([C@@H]1c1ccc(OC)cc1)C(O)=O)c1ccc2OCCc2c1
Show InChI InChI=1S/C30H40N2O5/c1-4-6-15-31(16-7-5-2)27(33)20-32-19-25(22-10-13-26-23(18-22)14-17-37-26)28(30(34)35)29(32)21-8-11-24(36-3)12-9-21/h8-13,18,25,28-29H,4-7,14-17,19-20H2,1-3H3,(H,34,35)/t25-,28-,29+/m1/s1
Reactome pathway
n/an/a 2.60E+3n/an/an/an/an/an/a
Abbott Laboratories
Curated by ChEMBL
Assay Description
Binding affinity towards endothelin B receptor in porcine cerebellar tissue using [125I]-ET-1 as radioligand.
J Med Chem 40: 322-30 (1997)
Article DOI: 10.1021/jm960077r
BindingDB Entry DOI: 10.7270/Q20C4TV2
EDNRB
(Homo sapiens (Human))
BDBM50056066
((2R,3R,4S)-1-Dibutylcarbamoylmethyl-4-(2,3-dihydro...)
Show SMILES CCCCN(CCCC)C(=O)CN1C[C@@H]([C@H]([C@@H]1c1ccc(OC)cc1)C(O)=O)c1ccc2OCCc2c1
Show InChI InChI=1S/C30H40N2O5/c1-4-6-15-31(16-7-5-2)27(33)20-32-19-25(22-10-13-26-23(18-22)14-17-37-26)28(30(34)35)29(32)21-8-11-24(36-3)12-9-21/h8-13,18,25,28-29H,4-7,14-17,19-20H2,1-3H3,(H,34,35)/t25-,28-,29+/m1/s1
n/an/a 2.67E+3n/an/an/an/an/an/a
Abbott Laboratories
Curated by ChEMBL
Assay Description
Binding affinity against endothelin B receptor in porcine cerebellar tissue
J Med Chem 44: 3978-84 (2001)
BindingDB Entry DOI: 10.7270/Q2JS9PR2
EDNRA
(RAT)
BDBM50056066
((2R,3R,4S)-1-Dibutylcarbamoylmethyl-4-(2,3-dihydro...)
Show SMILES CCCCN(CCCC)C(=O)CN1C[C@@H]([C@H]([C@@H]1c1ccc(OC)cc1)C(O)=O)c1ccc2OCCc2c1
Show InChI InChI=1S/C30H40N2O5/c1-4-6-15-31(16-7-5-2)27(33)20-32-19-25(22-10-13-26-23(18-22)14-17-37-26)28(30(34)35)29(32)21-8-11-24(36-3)12-9-21/h8-13,18,25,28-29H,4-7,14-17,19-20H2,1-3H3,(H,34,35)/t25-,28-,29+/m1/s1
Reactome pathway
n/an/a 0.600n/an/an/an/an/an/a
Abbott Laboratories
Curated by ChEMBL
Assay Description
Binding affinity against endothelin A receptor in MMQ cells in rat
J Med Chem 44: 3978-84 (2001)
BindingDB Entry DOI: 10.7270/Q2JS9PR2
EDNRA
(RAT)
BDBM50056066
((2R,3R,4S)-1-Dibutylcarbamoylmethyl-4-(2,3-dihydro...)
Show SMILES CCCCN(CCCC)C(=O)CN1C[C@@H]([C@H]([C@@H]1c1ccc(OC)cc1)C(O)=O)c1ccc2OCCc2c1
Show InChI InChI=1S/C30H40N2O5/c1-4-6-15-31(16-7-5-2)27(33)20-32-19-25(22-10-13-26-23(18-22)14-17-37-26)28(30(34)35)29(32)21-8-11-24(36-3)12-9-21/h8-13,18,25,28-29H,4-7,14-17,19-20H2,1-3H3,(H,34,35)/t25-,28-,29+/m1/s1
Reactome pathway
n/an/a 0.600n/an/an/an/an/an/a
Abbott Laboratories
Curated by ChEMBL
Assay Description
Binding affinity towards endothelin A receptor in prolactin secreting rat pituitary cells using [125I]-ET-1 as radioligand.
J Med Chem 40: 322-30 (1997)
Article DOI: 10.1021/jm960077r
BindingDB Entry DOI: 10.7270/Q20C4TV2