BDBM50056110 CHEMBL3327246
SMILES: COc1ccc2oc(=O)c(cc2c1)C(=O)NCCCCCCCNc1c2CCCCc2nc2ccccc12
InChI Key: InChIKey=YZNFMAJDGODDBL-UHFFFAOYSA-N
Data: 2 KI  1 IC50
Activity Spreadsheet -- Enzyme Inhibition Constant Data from BindingDB
Found 3 hits for monomerid = 50056110
Trg + Lig
Ki
nM
ΔG°
kcal/mole
IC50
nM
Kd
nM
EC50/IC50
nM
koff
s-1
kon
M-1s-1
pHTemp
°C
Cholinesterases
(Homo sapiens (Human))
BDBM50056110
(CHEMBL3327246)
Show SMILES COc1ccc2oc(=O)c(cc2c1)C(=O)NCCCCCCCNc1c2CCCCc2nc2ccccc12
Show InChI InChI=1S/C31H35N3O4/c1-37-22-15-16-28-21(19-22)20-25(31(36)38-28)30(35)33-18-10-4-2-3-9-17-32-29-23-11-5-7-13-26(23)34-27-14-8-6-12-24(27)29/h5,7,11,13,15-16,19-20H,2-4,6,8-10,12,14,17-18H2,1H3,(H,32,34)(H,33,35)
Reactome pathway
35n/an/an/an/an/an/an/an/a
Central China Normal University
Curated by ChEMBL
Assay Description
Inhibition of human BChE assessed as acetylthiocholine hydrolysis
Bioorg Med Chem 22: 4784-91 (2014)
Article DOI: 10.1016/j.bmc.2014.06.057
BindingDB Entry DOI: 10.7270/Q27M09KB
Acetylcholinesterase
(Homo sapiens (Human))
BDBM50056110
(CHEMBL3327246)
Show SMILES COc1ccc2oc(=O)c(cc2c1)C(=O)NCCCCCCCNc1c2CCCCc2nc2ccccc12
Show InChI InChI=1S/C31H35N3O4/c1-37-22-15-16-28-21(19-22)20-25(31(36)38-28)30(35)33-18-10-4-2-3-9-17-32-29-23-11-5-7-13-26(23)34-27-14-8-6-12-24(27)29/h5,7,11,13,15-16,19-20H,2-4,6,8-10,12,14,17-18H2,1H3,(H,32,34)(H,33,35)
NCI pathway
Reactome pathway
51n/an/an/an/an/an/an/an/a
Central China Normal University
Curated by ChEMBL
Assay Description
Inhibition of human AChE assessed as acetylthiocholine hydrolysis
Bioorg Med Chem 22: 4784-91 (2014)
Article DOI: 10.1016/j.bmc.2014.06.057
BindingDB Entry DOI: 10.7270/Q27M09KB
Beta-secretase 1
(Homo sapiens (Human))
BDBM50056110
(CHEMBL3327246)
Show SMILES COc1ccc2oc(=O)c(cc2c1)C(=O)NCCCCCCCNc1c2CCCCc2nc2ccccc12
Show InChI InChI=1S/C31H35N3O4/c1-37-22-15-16-28-21(19-22)20-25(31(36)38-28)30(35)33-18-10-4-2-3-9-17-32-29-23-11-5-7-13-26(23)34-27-14-8-6-12-24(27)29/h5,7,11,13,15-16,19-20H,2-4,6,8-10,12,14,17-18H2,1H3,(H,32,34)(H,33,35)
n/an/a 2.02E+4n/an/an/an/an/an/a
Central China Normal University
Curated by ChEMBL
Assay Description
Inhibition of beta-secretase (unknown origin) using 150 nM Rhodamine-EVNLDAEFK-quencher substrate proteolysis by fluorescence resonance energy transf...
Bioorg Med Chem 22: 4784-91 (2014)
Article DOI: 10.1016/j.bmc.2014.06.057
BindingDB Entry DOI: 10.7270/Q27M09KB