BDBM50056326 CHEMBL3322462
SMILES: Cc1c(nn(c1-c1ccc(Cl)cc1)-c1ccc(Cl)cc1Cl)C(=O)NCCCCCCCCNC(=O)[C@@H]1CCC[C@H](C1)C(=O)NCCCCCCCCNC(=O)c1nn(c(c1C)-c1ccc(Cl)cc1)-c1ccc(Cl)cc1Cl
InChI Key: InChIKey=SDGDQGXNKCBLHX-NCRNUEESSA-N
Data: 2 EC50
Activity Spreadsheet -- Enzyme Inhibition Constant Data from BindingDB
Found 2 hits for monomerid = 50056326
Trg + Lig
Ki
nM
ΔG°
kcal/mole
IC50
nM
Kd
nM
EC50/IC50
nM
koff
s-1
kon
M-1s-1
pHTemp
°C
Cannabinoid receptor 1
(Homo sapiens (Human))
BDBM50056326
(CHEMBL3322462)
Show SMILES Cc1c(nn(c1-c1ccc(Cl)cc1)-c1ccc(Cl)cc1Cl)C(=O)NCCCCCCCCNC(=O)[C@@H]1CCC[C@H](C1)C(=O)NCCCCCCCCNC(=O)c1nn(c(c1C)-c1ccc(Cl)cc1)-c1ccc(Cl)cc1Cl |r|
Show InChI InChI=1S/C58H66Cl6N8O4/c1-37-51(69-71(49-28-26-45(61)35-47(49)63)53(37)39-18-22-43(59)23-19-39)57(75)67-32-13-9-5-3-7-11-30-65-55(73)41-16-15-17-42(34-41)56(74)66-31-12-8-4-6-10-14-33-68-58(76)52-38(2)54(40-20-24-44(60)25-21-40)72(70-52)50-29-27-46(62)36-48(50)64/h18-29,35-36,41-42H,3-17,30-34H2,1-2H3,(H,65,73)(H,66,74)(H,67,75)(H,68,76)/t41-,42-/m1/s1
NCI pathway
Reactome pathway
n/an/an/an/a 7.60E+3n/an/an/an/a
Julius-Maximilians-Universit£t W£rzburg
Curated by ChEMBL
Assay Description
Inverse agonist activity at human CB1 receptor expressed in Sf9 cells coexpressing Gbeta1gamma2 and RSG4 assessed as degradation of [gamma-33P]GTP af...
Bioorg Med Chem Lett 24: 4209-14 (2014)
Article DOI: 10.1016/j.bmcl.2014.07.038
BindingDB Entry DOI: 10.7270/Q26M38HV
Cannabinoid receptor 1
(Homo sapiens (Human))
BDBM50056326
(CHEMBL3322462)
Show SMILES Cc1c(nn(c1-c1ccc(Cl)cc1)-c1ccc(Cl)cc1Cl)C(=O)NCCCCCCCCNC(=O)[C@@H]1CCC[C@H](C1)C(=O)NCCCCCCCCNC(=O)c1nn(c(c1C)-c1ccc(Cl)cc1)-c1ccc(Cl)cc1Cl |r|
Show InChI InChI=1S/C58H66Cl6N8O4/c1-37-51(69-71(49-28-26-45(61)35-47(49)63)53(37)39-18-22-43(59)23-19-39)57(75)67-32-13-9-5-3-7-11-30-65-55(73)41-16-15-17-42(34-41)56(74)66-31-12-8-4-6-10-14-33-68-58(76)52-38(2)54(40-20-24-44(60)25-21-40)72(70-52)50-29-27-46(62)36-48(50)64/h18-29,35-36,41-42H,3-17,30-34H2,1-2H3,(H,65,73)(H,66,74)(H,67,75)(H,68,76)/t41-,42-/m1/s1
NCI pathway
Reactome pathway
n/an/an/an/a 7.59E+3n/an/an/an/a
Julius-Maximilians-Universit£t W£rzburg
Curated by ChEMBL
Assay Description
Inverse agonist activity at human CB1 receptor expressed in Sf9 cells coexpressing Gbeta1gamma2 and RSG4 assessed as degradation of [gamma-33P]GTP af...
Bioorg Med Chem Lett 24: 4209-14 (2014)
Article DOI: 10.1016/j.bmcl.2014.07.038
BindingDB Entry DOI: 10.7270/Q26M38HV