BDBM50056337 CHEMBL3322474
SMILES: Cc1c(nn(c1-c1ccc(Cl)cc1)-c1ccc(Cl)cc1Cl)C(=O)NCCCCCCCCNC(=O)C1CCCCC1
InChI Key: InChIKey=WOCJKSWJVDFZBH-UHFFFAOYSA-N
Data: 2 EC50
Activity Spreadsheet -- Enzyme Inhibition Constant Data from BindingDB
Found 2 hits for monomerid = 50056337
Trg + Lig
Ki
nM
ΔG°
kcal/mole
IC50
nM
Kd
nM
EC50/IC50
nM
koff
s-1
kon
M-1s-1
pHTemp
°C
Cannabinoid receptor 1
(Homo sapiens (Human))
BDBM50056337
(CHEMBL3322474)
Show SMILES Cc1c(nn(c1-c1ccc(Cl)cc1)-c1ccc(Cl)cc1Cl)C(=O)NCCCCCCCCNC(=O)C1CCCCC1
Show InChI InChI=1S/C32H39Cl3N4O2/c1-22-29(32(41)37-20-10-5-3-2-4-9-19-36-31(40)24-11-7-6-8-12-24)38-39(28-18-17-26(34)21-27(28)35)30(22)23-13-15-25(33)16-14-23/h13-18,21,24H,2-12,19-20H2,1H3,(H,36,40)(H,37,41)
NCI pathway
Reactome pathway
n/an/an/an/a 1.10E+3n/an/an/an/a
Julius-Maximilians-Universit£t W£rzburg
Curated by ChEMBL
Assay Description
Inverse agonist activity at human CB1 receptor expressed in Sf9 cells coexpressing Gbeta1gamma2 and RSG4 assessed as degradation of [gamma-33P]GTP af...
Bioorg Med Chem Lett 24: 4209-14 (2014)
Article DOI: 10.1016/j.bmcl.2014.07.038
BindingDB Entry DOI: 10.7270/Q26M38HV
Cannabinoid receptor 1
(Homo sapiens (Human))
BDBM50056337
(CHEMBL3322474)
Show SMILES Cc1c(nn(c1-c1ccc(Cl)cc1)-c1ccc(Cl)cc1Cl)C(=O)NCCCCCCCCNC(=O)C1CCCCC1
Show InChI InChI=1S/C32H39Cl3N4O2/c1-22-29(32(41)37-20-10-5-3-2-4-9-19-36-31(40)24-11-7-6-8-12-24)38-39(28-18-17-26(34)21-27(28)35)30(22)23-13-15-25(33)16-14-23/h13-18,21,24H,2-12,19-20H2,1H3,(H,36,40)(H,37,41)
NCI pathway
Reactome pathway
n/an/an/an/a 1.10E+3n/an/an/an/a
Julius-Maximilians-Universit£t W£rzburg
Curated by ChEMBL
Assay Description
Inverse agonist activity at human CB1 receptor expressed in Sf9 cells coexpressing Gbeta1gamma2 and RSG4 assessed as degradation of [gamma-33P]GTP af...
Bioorg Med Chem Lett 24: 4209-14 (2014)
Article DOI: 10.1016/j.bmcl.2014.07.038
BindingDB Entry DOI: 10.7270/Q26M38HV