BDBM50056350 CHEMBL3322508
SMILES: OC(=O)c1cc(Br)ccc1S(=O)(=O)NCCCCN1C(=O)c2cccc3cccc(C1=O)c23
InChI Key: InChIKey=CGMFLYNZHMMUAI-UHFFFAOYSA-N
Data: 1 EC50
Activity Spreadsheet -- Enzyme Inhibition Constant Data from BindingDB
Found 1 hit for monomerid = 50056350
Trg + Lig
Ki
nM
ΔG°
kcal/mole
IC50
nM
Kd
nM
EC50/IC50
nM
koff
s-1
kon
M-1s-1
pHTemp
°C
Lysophosphatidic acid receptor 2
(Homo sapiens (Human))
BDBM50056350
(CHEMBL3322508)
Show SMILES OC(=O)c1cc(Br)ccc1S(=O)(=O)NCCCCN1C(=O)c2cccc3cccc(C1=O)c23
Show InChI InChI=1S/C23H19BrN2O6S/c24-15-9-10-19(18(13-15)23(29)30)33(31,32)25-11-1-2-12-26-21(27)16-7-3-5-14-6-4-8-17(20(14)16)22(26)28/h3-10,13,25H,1-2,11-12H2,(H,29,30)
NCI pathway
Reactome pathway
n/an/an/an/a 60n/an/an/an/a
The University of Tennessee Health Science Center
Curated by ChEMBL
Assay Description
Agonist activity at human LPA2 expressed in LPA1xLPA2 double knockout mouse MEF cells by Fura-2AM dye based Ca2+ mobilization assay
J Med Chem 57: 7136-40 (2014)
Article DOI: 10.1021/jm5007116
BindingDB Entry DOI: 10.7270/Q22V2HS4