BDBM50056503 CHEMBL3334823
SMILES: C[C@@H](O)CNC(=O)N[C@H](C(C)C)C(=O)N1CC[C@](O)(c2ccc(Cl)cc2)C(C)(C)C1
InChI Key: InChIKey=HMBHNHFKXQNPGY-LDJQZATESA-N
Data: 2 IC50  1 EC50
Activity Spreadsheet -- Enzyme Inhibition Constant Data from BindingDB
Found 3 hits for monomerid = 50056503
Trg + Lig
Ki
nM
ΔG°
kcal/mole
IC50
nM
Kd
nM
EC50/IC50
nM
koff
s-1
kon
M-1s-1
pHTemp
°C
C-C chemokine receptor type 1
(Homo sapiens (Human))
BDBM50056503
(CHEMBL3334823)
Show SMILES C[C@@H](O)CNC(=O)N[C@H](C(C)C)C(=O)N1CC[C@](O)(c2ccc(Cl)cc2)C(C)(C)C1 |r|
Show InChI InChI=1S/C22H34ClN3O4/c1-14(2)18(25-20(29)24-12-15(3)27)19(28)26-11-10-22(30,21(4,5)13-26)16-6-8-17(23)9-7-16/h6-9,14-15,18,27,30H,10-13H2,1-5H3,(H2,24,25,29)/t15-,18-,22+/m1/s1
Reactome pathway
n/an/a 2n/an/an/an/an/an/a
Bristol Myers Squibb Company
Curated by ChEMBL
Assay Description
Displacement of [125I]MIP-1alpha from CCR1 in human THP1 cells
J Med Chem 57: 7550-64 (2014)
Article DOI: 10.1021/jm5003167
BindingDB Entry DOI: 10.7270/Q2TB18JC
Pregnane X receptor
(Homo sapiens (Human))
BDBM50056503
(CHEMBL3334823)
Show SMILES C[C@@H](O)CNC(=O)N[C@H](C(C)C)C(=O)N1CC[C@](O)(c2ccc(Cl)cc2)C(C)(C)C1 |r|
Show InChI InChI=1S/C22H34ClN3O4/c1-14(2)18(25-20(29)24-12-15(3)27)19(28)26-11-10-22(30,21(4,5)13-26)16-6-8-17(23)9-7-16/h6-9,14-15,18,27,30H,10-13H2,1-5H3,(H2,24,25,29)/t15-,18-,22+/m1/s1
n/an/an/an/a>2.50E+4n/an/an/an/a
Bristol Myers Squibb Company
Curated by ChEMBL
Assay Description
Transactivation of human full-length PXR transfected in human HepG2 cells after 24 hrs by luciferase reporter gene assay
J Med Chem 57: 7550-64 (2014)
Article DOI: 10.1021/jm5003167
BindingDB Entry DOI: 10.7270/Q2TB18JC
C-C chemokine receptor type 1
(Homo sapiens (Human))
BDBM50056503
(CHEMBL3334823)
Show SMILES C[C@@H](O)CNC(=O)N[C@H](C(C)C)C(=O)N1CC[C@](O)(c2ccc(Cl)cc2)C(C)(C)C1 |r|
Show InChI InChI=1S/C22H34ClN3O4/c1-14(2)18(25-20(29)24-12-15(3)27)19(28)26-11-10-22(30,21(4,5)13-26)16-6-8-17(23)9-7-16/h6-9,14-15,18,27,30H,10-13H2,1-5H3,(H2,24,25,29)/t15-,18-,22+/m1/s1
Reactome pathway
n/an/a 6n/an/an/an/an/an/a
Bristol Myers Squibb Company
Curated by ChEMBL
Assay Description
Antagonist activity at CCR1 receptor in human THP1 cells assessed as inhibition of MIP-1alpha induced chemotaxis after 60 mins
J Med Chem 57: 7550-64 (2014)
Article DOI: 10.1021/jm5003167
BindingDB Entry DOI: 10.7270/Q2TB18JC