BDBM50056974 CHEMBL3329998
SMILES: ONC(=O)\C=C\c1ccc(cc1)S(=O)(=O)NCCc1c[nH]c2ccccc12
InChI Key: InChIKey=BUJPNJQQHZGAJV-JXMROGBWSA-N
Data: 1 IC50
Activity Spreadsheet -- Enzyme Inhibition Constant Data from BindingDB
Found 1 hit for monomerid = 50056974
Trg + Lig
Ki
nM
ΔG°
kcal/mole
IC50
nM
Kd
nM
EC50/IC50
nM
koff
s-1
kon
M-1s-1
pHTemp
°C
Histone deacetylase
(Homo sapiens (Human))
BDBM50056974
(CHEMBL3329998)
Show SMILES ONC(=O)\C=C\c1ccc(cc1)S(=O)(=O)NCCc1c[nH]c2ccccc12
Show InChI InChI=1S/C19H19N3O4S/c23-19(22-24)10-7-14-5-8-16(9-6-14)27(25,26)21-12-11-15-13-20-18-4-2-1-3-17(15)18/h1-10,13,20-21,24H,11-12H2,(H,22,23)/b10-7+
n/an/a 6.60n/an/an/an/an/an/a
Taipei Medical University
Curated by ChEMBL
Assay Description
Inhibition of HDAC in human HeLa cells nuclear extracts incubated for 30 mins by fluorescent assay
Eur J Med Chem 85: 468-79 (2014)
Article DOI: 10.1016/j.ejmech.2014.08.020
BindingDB Entry DOI: 10.7270/Q2NK3GQQ