BDBM50056982 CHEMBL3329994
SMILES: CCN(CC)CCn1c(C)c(CCNS(=O)(=O)c2ccc(\C=C\C(=O)NO)cc2)c2ccccc12
InChI Key: InChIKey=RIZOMAZFBKBGFE-NTCAYCPXSA-N
Data: 1 IC50
Activity Spreadsheet -- Enzyme Inhibition Constant Data from BindingDB
Found 1 hit for monomerid = 50056982
Trg + Lig
Ki
nM
ΔG°
kcal/mole
IC50
nM
Kd
nM
EC50/IC50
nM
koff
s-1
kon
M-1s-1
pHTemp
°C
Histone deacetylase
(Homo sapiens (Human))
BDBM50056982
(CHEMBL3329994)
Show SMILES CCN(CC)CCn1c(C)c(CCNS(=O)(=O)c2ccc(\C=C\C(=O)NO)cc2)c2ccccc12
Show InChI InChI=1S/C26H34N4O4S/c1-4-29(5-2)18-19-30-20(3)23(24-8-6-7-9-25(24)30)16-17-27-35(33,34)22-13-10-21(11-14-22)12-15-26(31)28-32/h6-15,27,32H,4-5,16-19H2,1-3H3,(H,28,31)/b15-12+
n/an/a 7.30n/an/an/an/an/an/a
Taipei Medical University
Curated by ChEMBL
Assay Description
Inhibition of HDAC in human HeLa cells nuclear extracts incubated for 30 mins by fluorescent assay
Eur J Med Chem 85: 468-79 (2014)
Article DOI: 10.1016/j.ejmech.2014.08.020
BindingDB Entry DOI: 10.7270/Q2NK3GQQ