BDBM50057166 CHEMBL10922::Sodium; (Z)-2-benzo[1,3]dioxol-5-yl-4-(4-methoxy-3-methyl-phenyl)-4-oxo-3-(3,4,5-trimethoxy-benzyl)-but-2-enoate
SMILES: COc1ccc(cc1C)C(=O)C(\Cc1cc(OC)c(OC)c(OC)c1)=C(/C([O-])=O)c1ccc2OCOc2c1
InChI Key: InChIKey=RDVXVKVLWVMYGT-QOMWVZHYSA-M
Data: 2 IC50
Activity Spreadsheet -- Enzyme Inhibition Constant Data from BindingDB
Found 2 hits for monomerid = 50057166
Trg + Lig
Ki
nM
ΔG°
kcal/mole
IC50
nM
Kd
nM
EC50/IC50
nM
koff
s-1
kon
M-1s-1
pHTemp
°C
Endothelin-1 receptor
(Homo sapiens (Human))
BDBM50057166
(CHEMBL10922 | Sodium; (Z)-2-benzo[1,3]dioxol-5-yl-...)
Show SMILES COc1ccc(cc1C)C(=O)C(\Cc1cc(OC)c(OC)c(OC)c1)=C(/C([O-])=O)c1ccc2OCOc2c1
Show InChI InChI=1S/C29H28O9/c1-16-10-19(7-8-21(16)33-2)27(30)20(11-17-12-24(34-3)28(36-5)25(13-17)35-4)26(29(31)32)18-6-9-22-23(14-18)38-15-37-22/h6-10,12-14H,11,15H2,1-5H3,(H,31,32)/p-1/b26-20-
n/an/a 0.980n/an/an/an/an/an/a
Warner-Lambert Company
Curated by ChEMBL
Assay Description
Inhibition of Endothelin A receptor mediated (ET-1) release of arachidonic acid from rabbit renal artery vascular smooth muscle cells
J Med Chem 40: 1063-74 (1997)
Article DOI: 10.1021/jm9606507
BindingDB Entry DOI: 10.7270/Q27P8XG5
EDNRB
(Homo sapiens (Human))
BDBM50057166
(CHEMBL10922 | Sodium; (Z)-2-benzo[1,3]dioxol-5-yl-...)
Show SMILES COc1ccc(cc1C)C(=O)C(\Cc1cc(OC)c(OC)c(OC)c1)=C(/C([O-])=O)c1ccc2OCOc2c1
Show InChI InChI=1S/C29H28O9/c1-16-10-19(7-8-21(16)33-2)27(30)20(11-17-12-24(34-3)28(36-5)25(13-17)35-4)26(29(31)32)18-6-9-22-23(14-18)38-15-37-22/h6-10,12-14H,11,15H2,1-5H3,(H,31,32)/p-1/b26-20-
n/an/a 1.90E+3n/an/an/an/an/an/a
Warner-Lambert Company
Curated by ChEMBL
Assay Description
Inhibition of Endothelin B receptor mediated (ET-3) release of arachidonic acid from human cloned receptors expressed in CHO-K1 cells
J Med Chem 40: 1063-74 (1997)
Article DOI: 10.1021/jm9606507
BindingDB Entry DOI: 10.7270/Q27P8XG5