BDBM50057178 CHEMBL10847::Sodium; (Z)-2-(7-methoxy-benzo[1,3]dioxol-5-yl)-4-(4-methoxy-3-methyl-phenyl)-4-oxo-3-(2,3,4-trimethoxy-benzyl)-but-2-enoate
SMILES: COc1cc(cc2OCOc12)C(\C([O-])=O)=C(/Cc1ccc(OC)c(OC)c1OC)C(=O)c1ccc(OC)c(C)c1
InChI Key: InChIKey=ICAHNKLYQDWFQQ-QQTULTPQSA-M
Data: 2 IC50
Activity Spreadsheet -- Enzyme Inhibition Constant Data from BindingDB
Found 2 hits for monomerid = 50057178
Trg + Lig
Ki
nM
ΔG°
kcal/mole
IC50
nM
Kd
nM
EC50/IC50
nM
koff
s-1
kon
M-1s-1
pHTemp
°C
Endothelin-1 receptor
(Homo sapiens (Human))
BDBM50057178
(CHEMBL10847 | Sodium; (Z)-2-(7-methoxy-benzo[1,3]d...)
Show SMILES COc1cc(cc2OCOc12)C(\C([O-])=O)=C(/Cc1ccc(OC)c(OC)c1OC)C(=O)c1ccc(OC)c(C)c1
Show InChI InChI=1S/C30H30O10/c1-16-11-17(7-9-21(16)34-2)26(31)20(12-18-8-10-22(35-3)29(38-6)27(18)37-5)25(30(32)33)19-13-23(36-4)28-24(14-19)39-15-40-28/h7-11,13-14H,12,15H2,1-6H3,(H,32,33)/p-1/b25-20-
n/an/a 0.780n/an/an/an/an/an/a
Warner-Lambert Company
Curated by ChEMBL
Assay Description
Inhibition of Endothelin A receptor mediated (ET-1) release of arachidonic acid from rabbit renal artery vascular smooth muscle cells
J Med Chem 40: 1063-74 (1997)
Article DOI: 10.1021/jm9606507
BindingDB Entry DOI: 10.7270/Q27P8XG5
EDNRB
(Homo sapiens (Human))
BDBM50057178
(CHEMBL10847 | Sodium; (Z)-2-(7-methoxy-benzo[1,3]d...)
Show SMILES COc1cc(cc2OCOc12)C(\C([O-])=O)=C(/Cc1ccc(OC)c(OC)c1OC)C(=O)c1ccc(OC)c(C)c1
Show InChI InChI=1S/C30H30O10/c1-16-11-17(7-9-21(16)34-2)26(31)20(12-18-8-10-22(35-3)29(38-6)27(18)37-5)25(30(32)33)19-13-23(36-4)28-24(14-19)39-15-40-28/h7-11,13-14H,12,15H2,1-6H3,(H,32,33)/p-1/b25-20-
n/an/a 68n/an/an/an/an/an/a
Warner-Lambert Company
Curated by ChEMBL
Assay Description
Inhibition of Endothelin B receptor mediated (ET-3) release of arachidonic acid from human cloned receptors expressed in CHO-K1 cells
J Med Chem 40: 1063-74 (1997)
Article DOI: 10.1021/jm9606507
BindingDB Entry DOI: 10.7270/Q27P8XG5