BDBM50057356 CHEMBL3322666
SMILES: Cc1cc(C)cc(c1)C(=O)N1CCC2(CC1)Nc1ccccc1-n1cccc21
InChI Key: InChIKey=RSOSLJOUUQFJTO-UHFFFAOYSA-N
Data: 2 IC50
Activity Spreadsheet -- Enzyme Inhibition Constant Data from BindingDB
Found 2 hits for monomerid = 50057356
Trg + Lig
Ki
nM
ΔG°
kcal/mole
IC50
nM
Kd
nM
EC50/IC50
nM
koff
s-1
kon
M-1s-1
pHTemp
°C
Sodium channel protein type 5 subunit alpha
(Homo sapiens (Human))
BDBM50057356
(CHEMBL3322666)
Show SMILES Cc1cc(C)cc(c1)C(=O)N1CCC2(CC1)Nc1ccccc1-n1cccc21
Show InChI InChI=1S/C24H25N3O/c1-17-14-18(2)16-19(15-17)23(28)26-12-9-24(10-13-26)22-8-5-11-27(22)21-7-4-3-6-20(21)25-24/h3-8,11,14-16,25H,9-10,12-13H2,1-2H3
n/an/a 1.78E+4n/an/an/an/an/an/a
Merck Research Laboratory
Curated by ChEMBL
Assay Description
Inhibition of human Nav1.5 channel expressed in HEK293 cells assessed as membrane potential after 60 mins by FLIPR assay
Bioorg Med Chem Lett 24: 4110-3 (2014)
Article DOI: 10.1016/j.bmcl.2014.07.060
BindingDB Entry DOI: 10.7270/Q24M9656
Sodium channel protein type 9 subunit alpha
(Homo sapiens (Human))
BDBM50057356
(CHEMBL3322666)
Show SMILES Cc1cc(C)cc(c1)C(=O)N1CCC2(CC1)Nc1ccccc1-n1cccc21
Show InChI InChI=1S/C24H25N3O/c1-17-14-18(2)16-19(15-17)23(28)26-12-9-24(10-13-26)22-8-5-11-27(22)21-7-4-3-6-20(21)25-24/h3-8,11,14-16,25H,9-10,12-13H2,1-2H3
n/an/a 47n/an/an/an/an/an/a
Merck Research Laboratory
Curated by ChEMBL
Assay Description
Inhibition of human Nav1.7 channel expressed in HEK293 cells assessed as membrane potential after 60 mins by FLIPR assay
Bioorg Med Chem Lett 24: 4110-3 (2014)
Article DOI: 10.1016/j.bmcl.2014.07.060
BindingDB Entry DOI: 10.7270/Q24M9656