BDBM50057463 1-[4-(4-Amino-6,7-dimethoxy-quinazolin-2-yl)-piperazin-1-yl]-2-(2-isopropyl-6-methoxy-phenoxy)-ethanone::CHEMBL430717
SMILES: COc1cc2nc(nc(N)c2cc1OC)N1CCN(CC1)C(=O)COc1c(OC)cccc1C(C)C
InChI Key: InChIKey=ZZMFJJDBKSYGRM-UHFFFAOYSA-N
Data: 3 KI  6 IC50
Activity Spreadsheet -- Enzyme Inhibition Constant Data from BindingDB
Found 9 hits for monomerid = 50057463
Trg + Lig
Ki
nM
ΔG°
kcal/mole
IC50
nM
Kd
nM
EC50/IC50
nM
koff
s-1
kon
M-1s-1
pHTemp
°C
Adrenergic alpha1B
(Homo sapiens (Human))
BDBM50057463
(1-[4-(4-Amino-6,7-dimethoxy-quinazolin-2-yl)-piper...)
Show SMILES COc1cc2nc(nc(N)c2cc1OC)N1CCN(CC1)C(=O)COc1c(OC)cccc1C(C)C
Show InChI InChI=1S/C26H33N5O5/c1-16(2)17-7-6-8-20(33-3)24(17)36-15-23(32)30-9-11-31(12-10-30)26-28-19-14-22(35-5)21(34-4)13-18(19)25(27)29-26/h6-8,13-14,16H,9-12,15H2,1-5H3,(H2,27,28,29)
0.450n/an/an/an/an/an/an/an/a
Recordati S.p.A.
Curated by ChEMBL
Assay Description
The binding affinity of the compound was determined towards Alpha-1B adrenergic receptor in the COS cell line.
J Med Chem 42: 427-37 (1999)
Article DOI: 10.1021/jm9805337
BindingDB Entry DOI: 10.7270/Q2FN15CK
Alpha-1A adrenergic receptor
(Rattus norvegicus (Rat))
BDBM50057463
(1-[4-(4-Amino-6,7-dimethoxy-quinazolin-2-yl)-piper...)
Show SMILES COc1cc2nc(nc(N)c2cc1OC)N1CCN(CC1)C(=O)COc1c(OC)cccc1C(C)C
Show InChI InChI=1S/C26H33N5O5/c1-16(2)17-7-6-8-20(33-3)24(17)36-15-23(32)30-9-11-31(12-10-30)26-28-19-14-22(35-5)21(34-4)13-18(19)25(27)29-26/h6-8,13-14,16H,9-12,15H2,1-5H3,(H2,27,28,29)
7.5n/an/an/an/an/an/an/an/a
Recordati S.p.A.
Curated by ChEMBL
Assay Description
The binding affinity of the compound was determined towards Alpha-1A adrenergic receptor in the COS cell line.
J Med Chem 42: 427-37 (1999)
Article DOI: 10.1021/jm9805337
BindingDB Entry DOI: 10.7270/Q2FN15CK
Alpha-1A adrenergic receptor
(Homo sapiens (Human))
BDBM50057463
(1-[4-(4-Amino-6,7-dimethoxy-quinazolin-2-yl)-piper...)
Show SMILES COc1cc2nc(nc(N)c2cc1OC)N1CCN(CC1)C(=O)COc1c(OC)cccc1C(C)C
Show InChI InChI=1S/C26H33N5O5/c1-16(2)17-7-6-8-20(33-3)24(17)36-15-23(32)30-9-11-31(12-10-30)26-28-19-14-22(35-5)21(34-4)13-18(19)25(27)29-26/h6-8,13-14,16H,9-12,15H2,1-5H3,(H2,27,28,29)
Reactome pathway
10.3n/an/an/an/an/an/an/an/a
Recordati S.p.A.
Curated by ChEMBL
Assay Description
The binding affinity of the compound was determined towards Alpha-1C adrenergic receptor in the COS cell line.
J Med Chem 42: 427-37 (1999)
Article DOI: 10.1021/jm9805337
BindingDB Entry DOI: 10.7270/Q2FN15CK
5-hydroxytryptamine receptor 2A
(Rattus norvegicus (rat))
BDBM50057463
(1-[4-(4-Amino-6,7-dimethoxy-quinazolin-2-yl)-piper...)
Show SMILES COc1cc2nc(nc(N)c2cc1OC)N1CCN(CC1)C(=O)COc1c(OC)cccc1C(C)C
Show InChI InChI=1S/C26H33N5O5/c1-16(2)17-7-6-8-20(33-3)24(17)36-15-23(32)30-9-11-31(12-10-30)26-28-19-14-22(35-5)21(34-4)13-18(19)25(27)29-26/h6-8,13-14,16H,9-12,15H2,1-5H3,(H2,27,28,29)
Reactome pathway
n/an/a>1.00E+3n/an/an/an/an/an/a
Recordati S.p.A.
Curated by ChEMBL
Assay Description
Inhibitory concentration against 5-hydroxytryptamine 2A receptor (Inactive at >1000 nM concentration)
J Med Chem 42: 427-37 (1999)
Article DOI: 10.1021/jm9805337
BindingDB Entry DOI: 10.7270/Q2FN15CK
Adrenergic alpha1B
(Homo sapiens (Human))
BDBM50057463
(1-[4-(4-Amino-6,7-dimethoxy-quinazolin-2-yl)-piper...)
Show SMILES COc1cc2nc(nc(N)c2cc1OC)N1CCN(CC1)C(=O)COc1c(OC)cccc1C(C)C
Show InChI InChI=1S/C26H33N5O5/c1-16(2)17-7-6-8-20(33-3)24(17)36-15-23(32)30-9-11-31(12-10-30)26-28-19-14-22(35-5)21(34-4)13-18(19)25(27)29-26/h6-8,13-14,16H,9-12,15H2,1-5H3,(H2,27,28,29)
n/an/a 1.20n/an/an/an/an/an/a
Pfizer Central Research
Curated by ChEMBL
Assay Description
Binding affinity was tested on cloned hamster Alpha-1B adrenergic receptor
J Med Chem 40: 1293-315 (1997)
Article DOI: 10.1021/jm960697s
BindingDB Entry DOI: 10.7270/Q2W096MN
D(2) dopamine receptor
(Rattus norvegicus (rat))
BDBM50057463
(1-[4-(4-Amino-6,7-dimethoxy-quinazolin-2-yl)-piper...)
Show SMILES COc1cc2nc(nc(N)c2cc1OC)N1CCN(CC1)C(=O)COc1c(OC)cccc1C(C)C
Show InChI InChI=1S/C26H33N5O5/c1-16(2)17-7-6-8-20(33-3)24(17)36-15-23(32)30-9-11-31(12-10-30)26-28-19-14-22(35-5)21(34-4)13-18(19)25(27)29-26/h6-8,13-14,16H,9-12,15H2,1-5H3,(H2,27,28,29)
Reactome pathway
n/an/a>1.00E+3n/an/an/an/an/an/a
Recordati S.p.A.
Curated by ChEMBL
Assay Description
Inhibitory concentration against Dopamine receptor D2 (Inactive at >1000 nM concentration)
J Med Chem 42: 427-37 (1999)
Article DOI: 10.1021/jm9805337
BindingDB Entry DOI: 10.7270/Q2FN15CK
Alpha-1D adrenergic receptor
(Rattus norvegicus (Rat))
BDBM50057463
(1-[4-(4-Amino-6,7-dimethoxy-quinazolin-2-yl)-piper...)
Show SMILES COc1cc2nc(nc(N)c2cc1OC)N1CCN(CC1)C(=O)COc1c(OC)cccc1C(C)C
Show InChI InChI=1S/C26H33N5O5/c1-16(2)17-7-6-8-20(33-3)24(17)36-15-23(32)30-9-11-31(12-10-30)26-28-19-14-22(35-5)21(34-4)13-18(19)25(27)29-26/h6-8,13-14,16H,9-12,15H2,1-5H3,(H2,27,28,29)
n/an/a 23n/an/an/an/an/an/a
Pfizer Central Research
Curated by ChEMBL
Assay Description
Binding affinity was tested on cloned rat Alpha-1D adrenergic receptor
J Med Chem 40: 1293-315 (1997)
Article DOI: 10.1021/jm960697s
BindingDB Entry DOI: 10.7270/Q2W096MN
Cerebral cortex alpha adrenergic receptor
(CALF)
BDBM50057463
(1-[4-(4-Amino-6,7-dimethoxy-quinazolin-2-yl)-piper...)
Show SMILES COc1cc2nc(nc(N)c2cc1OC)N1CCN(CC1)C(=O)COc1c(OC)cccc1C(C)C
Show InChI InChI=1S/C26H33N5O5/c1-16(2)17-7-6-8-20(33-3)24(17)36-15-23(32)30-9-11-31(12-10-30)26-28-19-14-22(35-5)21(34-4)13-18(19)25(27)29-26/h6-8,13-14,16H,9-12,15H2,1-5H3,(H2,27,28,29)
n/an/a 17n/an/an/an/an/an/a
Pfizer Central Research
Curated by ChEMBL
Assay Description
Binding affinity was tested on cloned bovine Alpha-1A adrenergic receptor
J Med Chem 40: 1293-315 (1997)
Article DOI: 10.1021/jm960697s
BindingDB Entry DOI: 10.7270/Q2W096MN
5-hydroxytryptamine receptor 1A
(Rattus norvegicus (rat))
BDBM50057463
(1-[4-(4-Amino-6,7-dimethoxy-quinazolin-2-yl)-piper...)
Show SMILES COc1cc2nc(nc(N)c2cc1OC)N1CCN(CC1)C(=O)COc1c(OC)cccc1C(C)C
Show InChI InChI=1S/C26H33N5O5/c1-16(2)17-7-6-8-20(33-3)24(17)36-15-23(32)30-9-11-31(12-10-30)26-28-19-14-22(35-5)21(34-4)13-18(19)25(27)29-26/h6-8,13-14,16H,9-12,15H2,1-5H3,(H2,27,28,29)
n/an/a>1.00E+3n/an/an/an/an/an/a
Recordati S.p.A.
Curated by ChEMBL
Assay Description
Inhibitory concentration against 5-hydroxytryptamine 1A receptor (Inactive at >1000 nM concentration)
J Med Chem 42: 427-37 (1999)
Article DOI: 10.1021/jm9805337
BindingDB Entry DOI: 10.7270/Q2FN15CK