BDBM50057477 4-(3-{3-[(4-Isobutyl-benzyl)-(4-isobutyl-phenyl)-amino]-benzoyl}-indol-1-yl)-butyric acid::4-[3-(3-{[Bis-(4-isobutyl-phenyl)-methyl]-amino}-benzoyl)-indol-1-yl]-butyric acid::CHEMBL25083::FK-143
SMILES: CC(C)Cc1ccc(cc1)C(Nc1cccc(c1)C(=O)c1cn(CCCC(O)=O)c2ccccc12)c1ccc(CC(C)C)cc1
InChI Key: InChIKey=LACIBZRFAYFTOV-UHFFFAOYSA-N
Data: 6 IC50
Activity Spreadsheet -- Enzyme Inhibition Constant Data from BindingDB
Found 6 hits for monomerid = 50057477
Trg + Lig
Ki
nM
ΔG°
kcal/mole
IC50
nM
Kd
nM
EC50/IC50
nM
koff
s-1
kon
M-1s-1
pHTemp
°C
Steroid 5-alpha-reductase
(Homo sapiens (Human))
BDBM50057477
(4-(3-{3-[(4-Isobutyl-benzyl)-(4-isobutyl-phenyl)-a...)
Show SMILES CC(C)Cc1ccc(cc1)C(Nc1cccc(c1)C(=O)c1cn(CCCC(O)=O)c2ccccc12)c1ccc(CC(C)C)cc1
Show InChI InChI=1S/C40H44N2O3/c1-27(2)23-29-14-18-31(19-15-29)39(32-20-16-30(17-21-32)24-28(3)4)41-34-10-7-9-33(25-34)40(45)36-26-42(22-8-13-38(43)44)37-12-6-5-11-35(36)37/h5-7,9-12,14-21,25-28,39,41H,8,13,22-24H2,1-4H3,(H,43,44)
Reactome pathway
n/an/a 11n/an/an/an/an/an/a
Sankyo Co., Ltd.
Curated by ChEMBL
Assay Description
In vitro inhibitory activity against human Steroid 5-alpha-reductase type 2 in COS-1 cells was determined
Bioorg Med Chem Lett 8: 561-6 (1999)
BindingDB Entry DOI: 10.7270/Q2571B5B
5α-Reductase 1 (5α-R1)
(Homo sapiens (Human))
BDBM50057477
(4-(3-{3-[(4-Isobutyl-benzyl)-(4-isobutyl-phenyl)-a...)
Show SMILES CC(C)Cc1ccc(cc1)C(Nc1cccc(c1)C(=O)c1cn(CCCC(O)=O)c2ccccc12)c1ccc(CC(C)C)cc1
Show InChI InChI=1S/C40H44N2O3/c1-27(2)23-29-14-18-31(19-15-29)39(32-20-16-30(17-21-32)24-28(3)4)41-34-10-7-9-33(25-34)40(45)36-26-42(22-8-13-38(43)44)37-12-6-5-11-35(36)37/h5-7,9-12,14-21,25-28,39,41H,8,13,22-24H2,1-4H3,(H,43,44)
n/an/a 3n/an/an/an/an/an/a
Sankyo Co., Ltd.
Curated by ChEMBL
Assay Description
In vitro inhibitory activity against human Steroid 5-alpha-reductase type 1 in COS-1 cells was determined
Bioorg Med Chem Lett 8: 561-6 (1999)
BindingDB Entry DOI: 10.7270/Q2571B5B
Steroid 5-alpha-reductase
(Rattus norvegicus)
BDBM50057477
(4-(3-{3-[(4-Isobutyl-benzyl)-(4-isobutyl-phenyl)-a...)
Show SMILES CC(C)Cc1ccc(cc1)C(Nc1cccc(c1)C(=O)c1cn(CCCC(O)=O)c2ccccc12)c1ccc(CC(C)C)cc1
Show InChI InChI=1S/C40H44N2O3/c1-27(2)23-29-14-18-31(19-15-29)39(32-20-16-30(17-21-32)24-28(3)4)41-34-10-7-9-33(25-34)40(45)36-26-42(22-8-13-38(43)44)37-12-6-5-11-35(36)37/h5-7,9-12,14-21,25-28,39,41H,8,13,22-24H2,1-4H3,(H,43,44)
n/an/a 4.20n/an/an/an/an/an/a
Zeria Pharmaceutical Co., Ltd.
Curated by ChEMBL
Assay Description
Inhibition of Steroid 5-alpha-reductase from Dawley rat prostate
Bioorg Med Chem Lett 9: 1553-8 (1999)
BindingDB Entry DOI: 10.7270/Q2DB841X
5α-Reductase 1 (5α-R1)
(Homo sapiens (Human))
BDBM50057477
(4-(3-{3-[(4-Isobutyl-benzyl)-(4-isobutyl-phenyl)-a...)
Show SMILES CC(C)Cc1ccc(cc1)C(Nc1cccc(c1)C(=O)c1cn(CCCC(O)=O)c2ccccc12)c1ccc(CC(C)C)cc1
Show InChI InChI=1S/C40H44N2O3/c1-27(2)23-29-14-18-31(19-15-29)39(32-20-16-30(17-21-32)24-28(3)4)41-34-10-7-9-33(25-34)40(45)36-26-42(22-8-13-38(43)44)37-12-6-5-11-35(36)37/h5-7,9-12,14-21,25-28,39,41H,8,13,22-24H2,1-4H3,(H,43,44)
n/an/a 38n/an/an/an/an/an/a
Pfizer Central Research
Curated by ChEMBL
Assay Description
Inhibitory concentration was tested on human 5-alpha reductase 1 isozyme
J Med Chem 40: 1293-315 (1997)
Article DOI: 10.1021/jm960697s
BindingDB Entry DOI: 10.7270/Q2W096MN
Steroid 5-alpha-reductase
(Rattus norvegicus)
BDBM50057477
(4-(3-{3-[(4-Isobutyl-benzyl)-(4-isobutyl-phenyl)-a...)
Show SMILES CC(C)Cc1ccc(cc1)C(Nc1cccc(c1)C(=O)c1cn(CCCC(O)=O)c2ccccc12)c1ccc(CC(C)C)cc1
Show InChI InChI=1S/C40H44N2O3/c1-27(2)23-29-14-18-31(19-15-29)39(32-20-16-30(17-21-32)24-28(3)4)41-34-10-7-9-33(25-34)40(45)36-26-42(22-8-13-38(43)44)37-12-6-5-11-35(36)37/h5-7,9-12,14-21,25-28,39,41H,8,13,22-24H2,1-4H3,(H,43,44)
n/an/a 118n/an/an/an/an/an/a
Sankyo Co., Ltd.
Curated by ChEMBL
Assay Description
In vitro inhibitory activity against rat testosterone 5 alpha reductase was determined
Bioorg Med Chem Lett 8: 561-6 (1999)
BindingDB Entry DOI: 10.7270/Q2571B5B
Steroid 5-alpha-reductase
(Homo sapiens (Human))
BDBM50057477
(4-(3-{3-[(4-Isobutyl-benzyl)-(4-isobutyl-phenyl)-a...)
Show SMILES CC(C)Cc1ccc(cc1)C(Nc1cccc(c1)C(=O)c1cn(CCCC(O)=O)c2ccccc12)c1ccc(CC(C)C)cc1
Show InChI InChI=1S/C40H44N2O3/c1-27(2)23-29-14-18-31(19-15-29)39(32-20-16-30(17-21-32)24-28(3)4)41-34-10-7-9-33(25-34)40(45)36-26-42(22-8-13-38(43)44)37-12-6-5-11-35(36)37/h5-7,9-12,14-21,25-28,39,41H,8,13,22-24H2,1-4H3,(H,43,44)
Reactome pathway
n/an/a 36n/an/an/an/an/an/a
Pfizer Central Research
Curated by ChEMBL
Assay Description
Inhibition of human 5-alpha reductase 2 isozyme.
J Med Chem 40: 1293-315 (1997)
Article DOI: 10.1021/jm960697s
BindingDB Entry DOI: 10.7270/Q2W096MN