BDBM50057540 4-[2-(4-Sulfamoyl-phenyl)-5-trifluoromethyl-2H-pyrazol-3-yl]-benzoic acid::CHEMBL743::Carboxylic acid metabolite of celecoxib
SMILES: NS(=O)(=O)c1ccc(cc1)-n1nc(cc1-c1ccc(cc1)C(O)=O)C(F)(F)F
InChI Key: InChIKey=WTHNOVFEXONZMI-UHFFFAOYSA-N
Data: 4 IC50
Activity Spreadsheet -- Enzyme Inhibition Constant Data from BindingDB
Found 4 hits for monomerid = 50057540
Trg + Lig
Ki
nM
ΔG°
kcal/mole
IC50
nM
Kd
nM
EC50/IC50
nM
koff
s-1
kon
M-1s-1
pHTemp
°C
Cyclooxygenase-1 (COX-1)
(Homo sapiens (Human))
BDBM50057540
(4-[2-(4-Sulfamoyl-phenyl)-5-trifluoromethyl-2H-pyr...)
Show SMILES NS(=O)(=O)c1ccc(cc1)-n1nc(cc1-c1ccc(cc1)C(O)=O)C(F)(F)F
Show InChI InChI=1S/C17H12F3N3O4S/c18-17(19,20)15-9-14(10-1-3-11(4-2-10)16(24)25)23(22-15)12-5-7-13(8-6-12)28(21,26)27/h1-9H,(H,24,25)(H2,21,26,27)
n/an/a>2.50E+5n/an/an/an/an/an/a
Searle Research and Development
Curated by ChEMBL
Assay Description
In vitro inhibitory concentration required to block recombinant human prostaglandin G/H synthase 1 (COX-1)
J Med Chem 40: 1347-65 (1997)
Article DOI: 10.1021/jm960803q
BindingDB Entry DOI: 10.7270/Q2Z89BHB
Prostaglandin G/H synthase (cyclooxygenase)
(Ovis aries (Sheep))
BDBM50057540
(4-[2-(4-Sulfamoyl-phenyl)-5-trifluoromethyl-2H-pyr...)
Show SMILES NS(=O)(=O)c1ccc(cc1)-n1nc(cc1-c1ccc(cc1)C(O)=O)C(F)(F)F
Show InChI InChI=1S/C17H12F3N3O4S/c18-17(19,20)15-9-14(10-1-3-11(4-2-10)16(24)25)23(22-15)12-5-7-13(8-6-12)28(21,26)27/h1-9H,(H,24,25)(H2,21,26,27)
n/an/a>2.51E+5n/an/an/an/an/an/a
Chinese Academy of Sciences
Curated by ChEMBL
Assay Description
Inhibitory activity against prostaglandin G/H synthase 1 (COX-1)
J Med Chem 45: 4816-27 (2002)
BindingDB Entry DOI: 10.7270/Q2XP764T
Cyclooxygenase-2 (COX-2)
(Mus musculus (Mouse))
BDBM50057540
(4-[2-(4-Sulfamoyl-phenyl)-5-trifluoromethyl-2H-pyr...)
Show SMILES NS(=O)(=O)c1ccc(cc1)-n1nc(cc1-c1ccc(cc1)C(O)=O)C(F)(F)F
Show InChI InChI=1S/C17H12F3N3O4S/c18-17(19,20)15-9-14(10-1-3-11(4-2-10)16(24)25)23(22-15)12-5-7-13(8-6-12)28(21,26)27/h1-9H,(H,24,25)(H2,21,26,27)
n/an/a 1.12E+4n/an/an/an/an/an/a
Chinese Academy of Sciences
Curated by ChEMBL
Assay Description
Inhibitory activity against prostaglandin G/H synthase 2 (COX-2)
J Med Chem 45: 4816-27 (2002)
BindingDB Entry DOI: 10.7270/Q2XP764T
Cyclooxygenase
(Homo sapiens (Human))
BDBM50057540
(4-[2-(4-Sulfamoyl-phenyl)-5-trifluoromethyl-2H-pyr...)
Show SMILES NS(=O)(=O)c1ccc(cc1)-n1nc(cc1-c1ccc(cc1)C(O)=O)C(F)(F)F
Show InChI InChI=1S/C17H12F3N3O4S/c18-17(19,20)15-9-14(10-1-3-11(4-2-10)16(24)25)23(22-15)12-5-7-13(8-6-12)28(21,26)27/h1-9H,(H,24,25)(H2,21,26,27)
NCI pathway
Reactome pathway
n/an/a 1.12E+4n/an/an/an/an/an/a
Searle Research and Development
Curated by ChEMBL
Assay Description
In vitro inhibitory concentration required to block human recombinant prostaglandin G/H synthase 2 (COX-2)
J Med Chem 40: 1347-65 (1997)
Article DOI: 10.1021/jm960803q
BindingDB Entry DOI: 10.7270/Q2Z89BHB