BDBM50057544 4-[5-(3,5-Dichloro-4-methoxy-phenyl)-3-difluoromethyl-pyrazol-1-yl]-benzenesulfonamide::CHEMBL287646
SMILES: COc1c(Cl)cc(cc1Cl)-c1cc(nn1-c1ccc(cc1)S(N)(=O)=O)C(F)F
InChI Key: InChIKey=ATGNWRJVESLUOP-UHFFFAOYSA-N
Data: 5 IC50
Activity Spreadsheet -- Enzyme Inhibition Constant Data from BindingDB
Found 5 hits for monomerid = 50057544
Trg + Lig
Ki
nM
ΔG°
kcal/mole
IC50
nM
Kd
nM
EC50/IC50
nM
koff
s-1
kon
M-1s-1
pHTemp
°C
Cyclooxygenase-1 (COX-1)
(Homo sapiens (Human))
BDBM50057544
(4-[5-(3,5-Dichloro-4-methoxy-phenyl)-3-difluoromet...)
Show SMILES COc1c(Cl)cc(cc1Cl)-c1cc(nn1-c1ccc(cc1)S(N)(=O)=O)C(F)F
Show InChI InChI=1S/C17H13Cl2F2N3O3S/c1-27-16-12(18)6-9(7-13(16)19)15-8-14(17(20)21)23-24(15)10-2-4-11(5-3-10)28(22,25)26/h2-8,17H,1H3,(H2,22,25,26)
n/an/a 7.70E+4n/an/an/an/an/an/a
Searle Research and Development
Curated by ChEMBL
Assay Description
In vitro inhibitory concentration required to block recombinant human prostaglandin G/H synthase 1 (COX-1)
J Med Chem 40: 1347-65 (1997)
Article DOI: 10.1021/jm960803q
BindingDB Entry DOI: 10.7270/Q2Z89BHB
Cyclooxygenase
(Homo sapiens (Human))
BDBM50057544
(4-[5-(3,5-Dichloro-4-methoxy-phenyl)-3-difluoromet...)
Show SMILES COc1c(Cl)cc(cc1Cl)-c1cc(nn1-c1ccc(cc1)S(N)(=O)=O)C(F)F
Show InChI InChI=1S/C17H13Cl2F2N3O3S/c1-27-16-12(18)6-9(7-13(16)19)15-8-14(17(20)21)23-24(15)10-2-4-11(5-3-10)28(22,25)26/h2-8,17H,1H3,(H2,22,25,26)
NCI pathway
Reactome pathway
n/an/a 21n/an/an/an/an/an/a
Searle Research and Development
Curated by ChEMBL
Assay Description
In vitro inhibitory concentration required to block human recombinant prostaglandin G/H synthase 2 (COX-2)
J Med Chem 40: 1347-65 (1997)
Article DOI: 10.1021/jm960803q
BindingDB Entry DOI: 10.7270/Q2Z89BHB
Prostaglandin G/H synthase (cyclooxygenase)
(Ovis aries (Sheep))
BDBM50057544
(4-[5-(3,5-Dichloro-4-methoxy-phenyl)-3-difluoromet...)
Show SMILES COc1c(Cl)cc(cc1Cl)-c1cc(nn1-c1ccc(cc1)S(N)(=O)=O)C(F)F
Show InChI InChI=1S/C17H13Cl2F2N3O3S/c1-27-16-12(18)6-9(7-13(16)19)15-8-14(17(20)21)23-24(15)10-2-4-11(5-3-10)28(22,25)26/h2-8,17H,1H3,(H2,22,25,26)
n/an/a 7.76E+4n/an/an/an/an/an/a
Chinese Academy of Sciences
Curated by ChEMBL
Assay Description
Inhibitory activity against prostaglandin G/H synthase 1 (COX-1)
J Med Chem 45: 4816-27 (2002)
BindingDB Entry DOI: 10.7270/Q2XP764T
Cyclooxygenase-2 (COX-2)
(Mus musculus (Mouse))
BDBM50057544
(4-[5-(3,5-Dichloro-4-methoxy-phenyl)-3-difluoromet...)
Show SMILES COc1c(Cl)cc(cc1Cl)-c1cc(nn1-c1ccc(cc1)S(N)(=O)=O)C(F)F
Show InChI InChI=1S/C17H13Cl2F2N3O3S/c1-27-16-12(18)6-9(7-13(16)19)15-8-14(17(20)21)23-24(15)10-2-4-11(5-3-10)28(22,25)26/h2-8,17H,1H3,(H2,22,25,26)
n/an/a 20.9n/an/an/an/an/an/a
Chinese Academy of Sciences
Curated by ChEMBL
Assay Description
Inhibitory activity against prostaglandin G/H synthase 2 (COX-2)
J Med Chem 45: 4816-27 (2002)
BindingDB Entry DOI: 10.7270/Q2XP764T
Cyclooxygenase
(Homo sapiens (Human))
BDBM50057544
(4-[5-(3,5-Dichloro-4-methoxy-phenyl)-3-difluoromet...)
Show SMILES COc1c(Cl)cc(cc1Cl)-c1cc(nn1-c1ccc(cc1)S(N)(=O)=O)C(F)F
Show InChI InChI=1S/C17H13Cl2F2N3O3S/c1-27-16-12(18)6-9(7-13(16)19)15-8-14(17(20)21)23-24(15)10-2-4-11(5-3-10)28(22,25)26/h2-8,17H,1H3,(H2,22,25,26)
NCI pathway
Reactome pathway
n/an/a 20.9n/an/an/an/an/an/a
Universit£ de Lille 2
Curated by ChEMBL
Assay Description
Inhibition of human Prostaglandin G/H synthase 2
J Med Chem 44: 3223-30 (2001)
BindingDB Entry DOI: 10.7270/Q2736S4D