BDBM50057557 4-(5-Pyridin-3-yl-3-trifluoromethyl-pyrazol-1-yl)-benzenesulfonamide::CHEMBL406140
SMILES: NS(=O)(=O)c1ccc(cc1)-n1nc(cc1-c1cccnc1)C(F)(F)F
InChI Key: InChIKey=VFPHVBJYKBFMQF-UHFFFAOYSA-N
Data: 4 IC50
Activity Spreadsheet -- Enzyme Inhibition Constant Data from BindingDB
Found 4 hits for monomerid = 50057557
Trg + Lig
Ki
nM
ΔG°
kcal/mole
IC50
nM
Kd
nM
EC50/IC50
nM
koff
s-1
kon
M-1s-1
pHTemp
°C
Cyclooxygenase-1 (COX-1)
(Homo sapiens (Human))
BDBM50057557
(4-(5-Pyridin-3-yl-3-trifluoromethyl-pyrazol-1-yl)-...)
Show SMILES NS(=O)(=O)c1ccc(cc1)-n1nc(cc1-c1cccnc1)C(F)(F)F
Show InChI InChI=1S/C15H11F3N4O2S/c16-15(17,18)14-8-13(10-2-1-7-20-9-10)22(21-14)11-3-5-12(6-4-11)25(19,23)24/h1-9H,(H2,19,23,24)
n/an/a>1.00E+5n/an/an/an/an/an/a
Searle Research and Development
Curated by ChEMBL
Assay Description
In vitro inhibitory concentration required to block recombinant human prostaglandin G/H synthase 1 (COX-1)
J Med Chem 40: 1347-65 (1997)
Article DOI: 10.1021/jm960803q
BindingDB Entry DOI: 10.7270/Q2Z89BHB
Prostaglandin G/H synthase (cyclooxygenase)
(Ovis aries (Sheep))
BDBM50057557
(4-(5-Pyridin-3-yl-3-trifluoromethyl-pyrazol-1-yl)-...)
Show SMILES NS(=O)(=O)c1ccc(cc1)-n1nc(cc1-c1cccnc1)C(F)(F)F
Show InChI InChI=1S/C15H11F3N4O2S/c16-15(17,18)14-8-13(10-2-1-7-20-9-10)22(21-14)11-3-5-12(6-4-11)25(19,23)24/h1-9H,(H2,19,23,24)
n/an/a>1.00E+5n/an/an/an/an/an/a
Chinese Academy of Sciences
Curated by ChEMBL
Assay Description
Inhibitory activity against prostaglandin G/H synthase 1 (COX-1)
J Med Chem 45: 4816-27 (2002)
BindingDB Entry DOI: 10.7270/Q2XP764T
Cyclooxygenase-2 (COX-2)
(Mus musculus (Mouse))
BDBM50057557
(4-(5-Pyridin-3-yl-3-trifluoromethyl-pyrazol-1-yl)-...)
Show SMILES NS(=O)(=O)c1ccc(cc1)-n1nc(cc1-c1cccnc1)C(F)(F)F
Show InChI InChI=1S/C15H11F3N4O2S/c16-15(17,18)14-8-13(10-2-1-7-20-9-10)22(21-14)11-3-5-12(6-4-11)25(19,23)24/h1-9H,(H2,19,23,24)
n/an/a 4.47E+4n/an/an/an/an/an/a
Chinese Academy of Sciences
Curated by ChEMBL
Assay Description
Inhibitory activity against prostaglandin G/H synthase 2 (COX-2)
J Med Chem 45: 4816-27 (2002)
BindingDB Entry DOI: 10.7270/Q2XP764T
Cyclooxygenase
(Homo sapiens (Human))
BDBM50057557
(4-(5-Pyridin-3-yl-3-trifluoromethyl-pyrazol-1-yl)-...)
Show SMILES NS(=O)(=O)c1ccc(cc1)-n1nc(cc1-c1cccnc1)C(F)(F)F
Show InChI InChI=1S/C15H11F3N4O2S/c16-15(17,18)14-8-13(10-2-1-7-20-9-10)22(21-14)11-3-5-12(6-4-11)25(19,23)24/h1-9H,(H2,19,23,24)
NCI pathway
Reactome pathway
n/an/a 4.50E+4n/an/an/an/an/an/a
Searle Research and Development
Curated by ChEMBL
Assay Description
In vitro inhibitory concentration required to block human recombinant prostaglandin G/H synthase 2 (COX-2)
J Med Chem 40: 1347-65 (1997)
Article DOI: 10.1021/jm960803q
BindingDB Entry DOI: 10.7270/Q2Z89BHB