BDBM50057560 4-[5-(3,4-Dichloro-phenyl)-3-trifluoromethyl-pyrazol-1-yl]-benzenesulfonamide::CHEMBL29717
SMILES: NS(=O)(=O)c1ccc(cc1)-n1nc(cc1-c1ccc(Cl)c(Cl)c1)C(F)(F)F
InChI Key: InChIKey=QWZJQZBFJWDVON-UHFFFAOYSA-N
Data: 6 IC50
Activity Spreadsheet -- Enzyme Inhibition Constant Data from BindingDB
Found 6 hits for monomerid = 50057560
Trg + Lig
Ki
nM
ΔG°
kcal/mole
IC50
nM
Kd
nM
EC50/IC50
nM
koff
s-1
kon
M-1s-1
pHTemp
°C
Cyclooxygenase-1 (COX-1)
(Homo sapiens (Human))
BDBM50057560
(4-[5-(3,4-Dichloro-phenyl)-3-trifluoromethyl-pyraz...)
Show SMILES NS(=O)(=O)c1ccc(cc1)-n1nc(cc1-c1ccc(Cl)c(Cl)c1)C(F)(F)F
Show InChI InChI=1S/C16H10Cl2F3N3O2S/c17-12-6-1-9(7-13(12)18)14-8-15(16(19,20)21)23-24(14)10-2-4-11(5-3-10)27(22,25)26/h1-8H,(H2,22,25,26)
n/an/a 1.74E+4n/an/an/an/an/an/a
Searle Research and Development
Curated by ChEMBL
Assay Description
In vitro inhibitory concentration required to block recombinant human prostaglandin G/H synthase 1 (COX-1)
J Med Chem 40: 1347-65 (1997)
Article DOI: 10.1021/jm960803q
BindingDB Entry DOI: 10.7270/Q2Z89BHB
Cyclooxygenase
(Homo sapiens (Human))
BDBM50057560
(4-[5-(3,4-Dichloro-phenyl)-3-trifluoromethyl-pyraz...)
Show SMILES NS(=O)(=O)c1ccc(cc1)-n1nc(cc1-c1ccc(Cl)c(Cl)c1)C(F)(F)F
Show InChI InChI=1S/C16H10Cl2F3N3O2S/c17-12-6-1-9(7-13(12)18)14-8-15(16(19,20)21)23-24(14)10-2-4-11(5-3-10)27(22,25)26/h1-8H,(H2,22,25,26)
NCI pathway
Reactome pathway
n/an/a 15n/an/an/an/an/an/a
Searle Research and Development
Curated by ChEMBL
Assay Description
In vitro inhibitory concentration required to block human recombinant prostaglandin G/H synthase 2 (COX-2)
J Med Chem 40: 1347-65 (1997)
Article DOI: 10.1021/jm960803q
BindingDB Entry DOI: 10.7270/Q2Z89BHB
Prostaglandin G/H synthase (cyclooxygenase)
(Ovis aries (Sheep))
BDBM50057560
(4-[5-(3,4-Dichloro-phenyl)-3-trifluoromethyl-pyraz...)
Show SMILES NS(=O)(=O)c1ccc(cc1)-n1nc(cc1-c1ccc(Cl)c(Cl)c1)C(F)(F)F
Show InChI InChI=1S/C16H10Cl2F3N3O2S/c17-12-6-1-9(7-13(12)18)14-8-15(16(19,20)21)23-24(14)10-2-4-11(5-3-10)27(22,25)26/h1-8H,(H2,22,25,26)
n/an/a 1.74E+4n/an/an/an/an/an/a
Chinese Academy of Sciences
Curated by ChEMBL
Assay Description
Inhibitory activity against prostaglandin G/H synthase 1 (COX-1)
J Med Chem 45: 4816-27 (2002)
BindingDB Entry DOI: 10.7270/Q2XP764T
Cyclooxygenase
(Homo sapiens (Human))
BDBM50057560
(4-[5-(3,4-Dichloro-phenyl)-3-trifluoromethyl-pyraz...)
Show SMILES NS(=O)(=O)c1ccc(cc1)-n1nc(cc1-c1ccc(Cl)c(Cl)c1)C(F)(F)F
Show InChI InChI=1S/C16H10Cl2F3N3O2S/c17-12-6-1-9(7-13(12)18)14-8-15(16(19,20)21)23-24(14)10-2-4-11(5-3-10)27(22,25)26/h1-8H,(H2,22,25,26)
NCI pathway
Reactome pathway
n/an/a 15.1n/an/an/an/an/an/a
Universit£ de Lille 2
Curated by ChEMBL
Assay Description
Inhibition of human Prostaglandin G/H synthase 2
J Med Chem 44: 3223-30 (2001)
BindingDB Entry DOI: 10.7270/Q2736S4D
Cyclooxygenase-2 (COX-2)
(Mus musculus (Mouse))
BDBM50057560
(4-[5-(3,4-Dichloro-phenyl)-3-trifluoromethyl-pyraz...)
Show SMILES NS(=O)(=O)c1ccc(cc1)-n1nc(cc1-c1ccc(Cl)c(Cl)c1)C(F)(F)F
Show InChI InChI=1S/C16H10Cl2F3N3O2S/c17-12-6-1-9(7-13(12)18)14-8-15(16(19,20)21)23-24(14)10-2-4-11(5-3-10)27(22,25)26/h1-8H,(H2,22,25,26)
n/an/a 15.1n/an/an/an/an/an/a
Chinese Academy of Sciences
Curated by ChEMBL
Assay Description
Inhibitory activity against prostaglandin G/H synthase 2 (COX-2)
J Med Chem 45: 4816-27 (2002)
BindingDB Entry DOI: 10.7270/Q2XP764T
Cyclooxygenase
(Homo sapiens (Human))
BDBM50057560
(4-[5-(3,4-Dichloro-phenyl)-3-trifluoromethyl-pyraz...)
Show SMILES NS(=O)(=O)c1ccc(cc1)-n1nc(cc1-c1ccc(Cl)c(Cl)c1)C(F)(F)F
Show InChI InChI=1S/C16H10Cl2F3N3O2S/c17-12-6-1-9(7-13(12)18)14-8-15(16(19,20)21)23-24(14)10-2-4-11(5-3-10)27(22,25)26/h1-8H,(H2,22,25,26)
NCI pathway
Reactome pathway
n/an/a 15n/an/an/an/an/an/a
Yale University
Curated by ChEMBL
Assay Description
Inhibitory concentration against human prostaglandin G/H synthase 2 at 25 degrees.
Bioorg Med Chem Lett 12: 267-70 (2002)
BindingDB Entry DOI: 10.7270/Q2Q23ZJQ