BDBM50057562 4-[3-Difluoromethyl-5-(4-methoxy-phenyl)-pyrazol-1-yl]-benzenesulfonamide::CHEMBL282085
SMILES: COc1ccc(cc1)-c1cc(nn1-c1ccc(cc1)S(N)(=O)=O)C(F)F
InChI Key: InChIKey=VSQLZYPQFJIORU-UHFFFAOYSA-N
Data: 3 IC50
Activity Spreadsheet -- Enzyme Inhibition Constant Data from BindingDB
Found 3 hits for monomerid = 50057562
Trg + Lig
Ki
nM
ΔG°
kcal/mole
IC50
nM
Kd
nM
EC50/IC50
nM
koff
s-1
kon
M-1s-1
pHTemp
°C
Cyclooxygenase-1 (COX-1)
(Homo sapiens (Human))
BDBM50057562
(4-[3-Difluoromethyl-5-(4-methoxy-phenyl)-pyrazol-1...)
Show SMILES COc1ccc(cc1)-c1cc(nn1-c1ccc(cc1)S(N)(=O)=O)C(F)F
Show InChI InChI=1S/C17H15F2N3O3S/c1-25-13-6-2-11(3-7-13)16-10-15(17(18)19)21-22(16)12-4-8-14(9-5-12)26(20,23)24/h2-10,17H,1H3,(H2,20,23,24)
n/an/a 830n/an/an/an/an/an/a
Searle Research and Development
Curated by ChEMBL
Assay Description
In vitro inhibitory concentration required to block recombinant human prostaglandin G/H synthase 1 (COX-1)
J Med Chem 40: 1347-65 (1997)
Article DOI: 10.1021/jm960803q
BindingDB Entry DOI: 10.7270/Q2Z89BHB
Cyclooxygenase
(Homo sapiens (Human))
BDBM50057562
(4-[3-Difluoromethyl-5-(4-methoxy-phenyl)-pyrazol-1...)
Show SMILES COc1ccc(cc1)-c1cc(nn1-c1ccc(cc1)S(N)(=O)=O)C(F)F
Show InChI InChI=1S/C17H15F2N3O3S/c1-25-13-6-2-11(3-7-13)16-10-15(17(18)19)21-22(16)12-4-8-14(9-5-12)26(20,23)24/h2-10,17H,1H3,(H2,20,23,24)
NCI pathway
Reactome pathway
n/an/a 15.1n/an/an/an/an/an/a
Universit£ de Lille 2
Curated by ChEMBL
Assay Description
Inhibition of human Prostaglandin G/H synthase 2
J Med Chem 44: 3223-30 (2001)
BindingDB Entry DOI: 10.7270/Q2736S4D
Cyclooxygenase
(Homo sapiens (Human))
BDBM50057562
(4-[3-Difluoromethyl-5-(4-methoxy-phenyl)-pyrazol-1...)
Show SMILES COc1ccc(cc1)-c1cc(nn1-c1ccc(cc1)S(N)(=O)=O)C(F)F
Show InChI InChI=1S/C17H15F2N3O3S/c1-25-13-6-2-11(3-7-13)16-10-15(17(18)19)21-22(16)12-4-8-14(9-5-12)26(20,23)24/h2-10,17H,1H3,(H2,20,23,24)
NCI pathway
Reactome pathway
n/an/a 15n/an/an/an/an/an/a
Searle Research and Development
Curated by ChEMBL
Assay Description
In vitro inhibitory concentration required to block human recombinant prostaglandin G/H synthase 2 (COX-2)
J Med Chem 40: 1347-65 (1997)
Article DOI: 10.1021/jm960803q
BindingDB Entry DOI: 10.7270/Q2Z89BHB