null
SMILES: COc1ccc(\C=N\OCC(O)CNN2CCOCC2)cc1OC1CCCC1
InChI Key: InChIKey=XRDGDVJELSEKQQ-LPYMAVHISA-N
Activity Spreadsheet -- Enzyme Inhibition Constant Data from BindingDB
Found 1 hit for monomerid = 50057794
Trg + Lig
Ki
nM
ΔG°
kcal/mole
IC50
nM
Kd
nM
EC50/IC50
nM
koff
s-1
kon
M-1s-1
pHTemp
°C
cAMP-specific 3',5'-cyclic phosphodiesterase 4D
(Homo sapiens (Human))
BDBM50057794
(CHEMBL3326089)
Show SMILES COc1ccc(\C=N\OCC(O)CNN2CCOCC2)cc1OC1CCCC1
Show InChI InChI=1S/C20H31N3O5/c1-25-19-7-6-16(12-20(19)28-18-4-2-3-5-18)13-22-27-15-17(24)14-21-23-8-10-26-11-9-23/h6-7,12-13,17-18,21,24H,2-5,8-11,14-15H2,1H3/b22-13+
n/an/a 1.26E+3n/an/an/an/an/an/a
University of Genoa
Curated by ChEMBL
Assay Description
Inhibition of recombinant human PDE4D3 expressed in baculoviral system
J Med Chem 57: 7061-72 (2014)
Article DOI: 10.1021/jm500855w
BindingDB Entry DOI: 10.7270/Q23N251C