BDBM50057822 1-(4-azido-5-hydroxymethyltetrahydro-2-furanyl)-3-{2-[1-(4-azido-5-hydroxymethyltetrahydro-2-furanyl)-5-methyl-2,4-dioxo-1,2,3,4-tetrahydro-3-pyrimidinyl]ethyl}-5-methyl-1,2,3,4-tetrahydro-2,4-pyrimidinedione::CHEMBL290088
SMILES: Cc1cn(C2CC(N=[N+]=[N-])C(CO)O2)c(=O)n(CCn2c(=O)c(C)cn(C3CC(N=[N+]=[N-])C(CO)O3)c2=O)c1=O
InChI Key: InChIKey=SAHKALZVWZCOIY-UHFFFAOYSA-N
Data: 1 EC50
Activity Spreadsheet -- Enzyme Inhibition Constant Data from BindingDB
Found 1 hit for monomerid = 50057822
Trg + Lig
Ki
nM
ΔG°
kcal/mole
IC50
nM
Kd
nM
EC50/IC50
nM
koff
s-1
kon
M-1s-1
pHTemp
°C
Human immunodeficiency virus type 1 reverse transcriptase
(Human immunodeficiency virus 1)
BDBM50057822
(1-(4-azido-5-hydroxymethyltetrahydro-2-furanyl)-3-...)
Show SMILES Cc1cn(C2CC(N=[N+]=[N-])C(CO)O2)c(=O)n(CCn2c(=O)c(C)cn(C3CC(N=[N+]=[N-])C(CO)O3)c2=O)c1=O
Show InChI InChI=1S/C22H28N10O8/c1-11-7-31(17-5-13(25-27-23)15(9-33)39-17)21(37)29(19(11)35)3-4-30-20(36)12(2)8-32(22(30)38)18-6-14(26-28-24)16(10-34)40-18/h7-8,13-18,33-34H,3-6,9-10H2,1-2H3
n/an/an/an/a 1.40E+3n/an/an/an/a
Institut de Chimie des Substances Naturelles CNRS
Curated by ChEMBL
Assay Description
Reverse transcriptase activity was measured in the culture supernatant, concentration that reduces by 50% the HIV produced in the supernatant.
J Med Chem 40: 1550-8 (1997)
Article DOI: 10.1021/jm9600095
BindingDB Entry DOI: 10.7270/Q2TH8KSM