BDBM50057988 4-[2-(3-Chloro-phenyl)-4-trifluoromethyl-imidazol-1-yl]-benzenesulfonamide::CHEMBL298269
SMILES: NS(=O)(=O)c1ccc(cc1)-n1cc(nc1-c1cccc(Cl)c1)C(F)(F)F
InChI Key: InChIKey=KQWMBKXAUUWQNW-UHFFFAOYSA-N
Data: 4 IC50
Activity Spreadsheet -- Enzyme Inhibition Constant Data from BindingDB
Found 4 hits for monomerid = 50057988
Trg + Lig
Ki
nM
ΔG°
kcal/mole
IC50
nM
Kd
nM
EC50/IC50
nM
koff
s-1
kon
M-1s-1
pHTemp
°C
Cyclooxygenase-1 (COX-1)
(Homo sapiens (Human))
BDBM50057988
(4-[2-(3-Chloro-phenyl)-4-trifluoromethyl-imidazol-...)
Show SMILES NS(=O)(=O)c1ccc(cc1)-n1cc(nc1-c1cccc(Cl)c1)C(F)(F)F
Show InChI InChI=1S/C16H11ClF3N3O2S/c17-11-3-1-2-10(8-11)15-22-14(16(18,19)20)9-23(15)12-4-6-13(7-5-12)26(21,24)25/h1-9H,(H2,21,24,25)
n/an/a 6.20E+3n/an/an/an/an/an/a
Searle Research and Development
Curated by ChEMBL
Assay Description
Concentration required to inhibit human prostaglandin G/H synthase 1 (COX-1) by 50%
J Med Chem 40: 1634-47 (1997)
Article DOI: 10.1021/jm9700225
BindingDB Entry DOI: 10.7270/Q2F76BN0
Cyclooxygenase-2 (COX-2)
(Mus musculus (Mouse))
BDBM50057988
(4-[2-(3-Chloro-phenyl)-4-trifluoromethyl-imidazol-...)
Show SMILES NS(=O)(=O)c1ccc(cc1)-n1cc(nc1-c1cccc(Cl)c1)C(F)(F)F
Show InChI InChI=1S/C16H11ClF3N3O2S/c17-11-3-1-2-10(8-11)15-22-14(16(18,19)20)9-23(15)12-4-6-13(7-5-12)26(21,24)25/h1-9H,(H2,21,24,25)
n/an/a 7.94n/an/an/an/an/an/a
University of Hyderabad
Curated by ChEMBL
Assay Description
Inhibitory activity against prostaglandin G/H synthase 2 (COX-2)
J Med Chem 45: 4847-57 (2002)
BindingDB Entry DOI: 10.7270/Q2SX6FFJ
Cyclooxygenase
(Homo sapiens (Human))
BDBM50057988
(4-[2-(3-Chloro-phenyl)-4-trifluoromethyl-imidazol-...)
Show SMILES NS(=O)(=O)c1ccc(cc1)-n1cc(nc1-c1cccc(Cl)c1)C(F)(F)F
Show InChI InChI=1S/C16H11ClF3N3O2S/c17-11-3-1-2-10(8-11)15-22-14(16(18,19)20)9-23(15)12-4-6-13(7-5-12)26(21,24)25/h1-9H,(H2,21,24,25)
NCI pathway
Reactome pathway
n/an/a 7.94n/an/an/an/an/an/a
Universit£ de Lille 2
Curated by ChEMBL
Assay Description
Inhibition of human Prostaglandin G/H synthase 2
J Med Chem 44: 3223-30 (2001)
BindingDB Entry DOI: 10.7270/Q2736S4D
Cyclooxygenase
(Homo sapiens (Human))
BDBM50057988
(4-[2-(3-Chloro-phenyl)-4-trifluoromethyl-imidazol-...)
Show SMILES NS(=O)(=O)c1ccc(cc1)-n1cc(nc1-c1cccc(Cl)c1)C(F)(F)F
Show InChI InChI=1S/C16H11ClF3N3O2S/c17-11-3-1-2-10(8-11)15-22-14(16(18,19)20)9-23(15)12-4-6-13(7-5-12)26(21,24)25/h1-9H,(H2,21,24,25)
NCI pathway
Reactome pathway
n/an/a 8n/an/an/an/an/an/a
Searle Research and Development
Curated by ChEMBL
Assay Description
Concentration required to inhibit human Prostaglandin G/H synthase 2 (COX-2) by 50%
J Med Chem 40: 1634-47 (1997)
Article DOI: 10.1021/jm9700225
BindingDB Entry DOI: 10.7270/Q2F76BN0