BDBM50058231 CHEMBL48807::N-[4-(2-Methoxy-phenyl)-piperazin-1-ylmethyl]-benzamide
SMILES: COc1ccccc1N1CCN(CNC(=O)c2ccccc2)CC1
InChI Key: InChIKey=UWUCDMAWZWXZPY-UHFFFAOYSA-N
Data: 6 KI  1 EC50
Activity Spreadsheet -- Enzyme Inhibition Constant Data from BindingDB
Found 7 hits for monomerid = 50058231
Trg + Lig
Ki
nM
ΔG°
kcal/mole
IC50
nM
Kd
nM
EC50/IC50
nM
koff
s-1
kon
M-1s-1
pHTemp
°C
D(4) dopamine receptor
(Homo sapiens (Human))
BDBM50058231
(CHEMBL48807 | N-[4-(2-Methoxy-phenyl)-piperazin-1-...)
Show SMILES COc1ccccc1N1CCN(CNC(=O)c2ccccc2)CC1
Show InChI InChI=1S/C19H23N3O2/c1-24-18-10-6-5-9-17(18)22-13-11-21(12-14-22)15-20-19(23)16-7-3-2-4-8-16/h2-10H,11-15H2,1H3,(H,20,23)
Reactome pathway
21.9n/an/an/an/an/an/an/an/a
Pomona College
Curated by ChEMBL
Assay Description
Binding affinity of compound towards human dopamine receptor D4 was determined
Bioorg Med Chem Lett 15: 2149-57 (2005)
Article DOI: 10.1016/j.bmcl.2005.02.012
BindingDB Entry DOI: 10.7270/Q2RR20G2
D(4) dopamine receptor
(Homo sapiens (Human))
BDBM50058231
(CHEMBL48807 | N-[4-(2-Methoxy-phenyl)-piperazin-1-...)
Show SMILES COc1ccccc1N1CCN(CNC(=O)c2ccccc2)CC1
Show InChI InChI=1S/C19H23N3O2/c1-24-18-10-6-5-9-17(18)22-13-11-21(12-14-22)15-20-19(23)16-7-3-2-4-8-16/h2-10H,11-15H2,1H3,(H,20,23)
Reactome pathway
22n/an/an/an/an/an/an/an/a
Warner-Lambert Company
Curated by ChEMBL
Assay Description
Binding affinity for human Dopamine receptor D4 expressed in CHO K1 transfected cells using [3H]-Spiperone as radioligand
J Med Chem 40: 1771-2 (1997)
Article DOI: 10.1021/jm970021c
BindingDB Entry DOI: 10.7270/Q2DB80XX
D(4) dopamine receptor
(Homo sapiens (Human))
BDBM50058231
(CHEMBL48807 | N-[4-(2-Methoxy-phenyl)-piperazin-1-...)
Show SMILES COc1ccccc1N1CCN(CNC(=O)c2ccccc2)CC1
Show InChI InChI=1S/C19H23N3O2/c1-24-18-10-6-5-9-17(18)22-13-11-21(12-14-22)15-20-19(23)16-7-3-2-4-8-16/h2-10H,11-15H2,1H3,(H,20,23)
Reactome pathway
30.9n/an/an/an/an/an/an/an/a
Pomona College
Curated by ChEMBL
Assay Description
Binding affinity towards human dopamine receptor D4 expressed in CHO cells was determined by using [3H]thymidine as radioligand
Bioorg Med Chem Lett 15: 2149-57 (2005)
Article DOI: 10.1016/j.bmcl.2005.02.012
BindingDB Entry DOI: 10.7270/Q2RR20G2
D(2) dopamine receptor
(Homo sapiens (Human))
BDBM50058231
(CHEMBL48807 | N-[4-(2-Methoxy-phenyl)-piperazin-1-...)
Show SMILES COc1ccccc1N1CCN(CNC(=O)c2ccccc2)CC1
Show InChI InChI=1S/C19H23N3O2/c1-24-18-10-6-5-9-17(18)22-13-11-21(12-14-22)15-20-19(23)16-7-3-2-4-8-16/h2-10H,11-15H2,1H3,(H,20,23)
Reactome pathway
1.88E+3n/an/an/an/an/an/an/an/a
Warner-Lambert Company
Curated by ChEMBL
Assay Description
Binding affinity for human Dopamine receptor D2 expressed in CHO K1 transfected cells using [3H]-Spiperone as radioligand
J Med Chem 40: 1771-2 (1997)
Article DOI: 10.1021/jm970021c
BindingDB Entry DOI: 10.7270/Q2DB80XX
D(2) dopamine receptor
(Homo sapiens (Human))
BDBM50058231
(CHEMBL48807 | N-[4-(2-Methoxy-phenyl)-piperazin-1-...)
Show SMILES COc1ccccc1N1CCN(CNC(=O)c2ccccc2)CC1
Show InChI InChI=1S/C19H23N3O2/c1-24-18-10-6-5-9-17(18)22-13-11-21(12-14-22)15-20-19(23)16-7-3-2-4-8-16/h2-10H,11-15H2,1H3,(H,20,23)
Reactome pathway
2.45E+3n/an/an/an/an/an/an/an/a
Pomona College
Curated by ChEMBL
Assay Description
Binding affinity towards human dopamine receptor D2 was determined by using [3H]spiperone as radioligand
Bioorg Med Chem Lett 15: 2149-57 (2005)
Article DOI: 10.1016/j.bmcl.2005.02.012
BindingDB Entry DOI: 10.7270/Q2RR20G2
D(3) dopamine receptor
(Homo sapiens (Human))
BDBM50058231
(CHEMBL48807 | N-[4-(2-Methoxy-phenyl)-piperazin-1-...)
Show SMILES COc1ccccc1N1CCN(CNC(=O)c2ccccc2)CC1
Show InChI InChI=1S/C19H23N3O2/c1-24-18-10-6-5-9-17(18)22-13-11-21(12-14-22)15-20-19(23)16-7-3-2-4-8-16/h2-10H,11-15H2,1H3,(H,20,23)
2.47E+3n/an/an/an/an/an/an/an/a
Warner-Lambert Company
Curated by ChEMBL
Assay Description
Binding affinity for human Dopamine receptor D3 expressed in CHO K1 transfected cells using [3H]-Spiperone as radioligand
J Med Chem 40: 1771-2 (1997)
Article DOI: 10.1021/jm970021c
BindingDB Entry DOI: 10.7270/Q2DB80XX
D(4) dopamine receptor
(Homo sapiens (Human))
BDBM50058231
(CHEMBL48807 | N-[4-(2-Methoxy-phenyl)-piperazin-1-...)
Show SMILES COc1ccccc1N1CCN(CNC(=O)c2ccccc2)CC1
Show InChI InChI=1S/C19H23N3O2/c1-24-18-10-6-5-9-17(18)22-13-11-21(12-14-22)15-20-19(23)16-7-3-2-4-8-16/h2-10H,11-15H2,1H3,(H,20,23)
Reactome pathway
n/an/an/an/a 31n/an/an/an/a
Warner-Lambert Company
Curated by ChEMBL
Assay Description
Agonist activation of human dopamine receptor stimulating mitogenesis in Dopamine receptor D4-transfected CHO pro-5 cells using [3H]-thymidine as rad...
J Med Chem 40: 1771-2 (1997)
Article DOI: 10.1021/jm970021c
BindingDB Entry DOI: 10.7270/Q2DB80XX