BDBM50058840 CHEMBL3325734
SMILES: Cl.CS(=O)(=O)N[C@@H](c1ccc(CNC[C@H]2COc3cccnc3O2)cc1)C(F)(F)F
InChI Key: InChIKey=ZCZAWNIQCXQZKW-DMLYUBSXSA-N
Data: 1 IC50
Activity Spreadsheet -- Enzyme Inhibition Constant Data from BindingDB
Found 1 hit for monomerid = 50058840
Trg + Lig
Ki
nM
ΔG°
kcal/mole
IC50
nM
Kd
nM
EC50/IC50
nM
koff
s-1
kon
M-1s-1
pHTemp
°C
Acyl-CoA:monoacylglycerol acyltransferase 2 (MOGAT2)
(Homo sapiens (Human))
BDBM50058840
(CHEMBL3325734)
Show SMILES Cl.CS(=O)(=O)N[C@@H](c1ccc(CNC[C@H]2COc3cccnc3O2)cc1)C(F)(F)F |r|
Show InChI InChI=1S/C18H20F3N3O4S.ClH/c1-29(25,26)24-16(18(19,20)21)13-6-4-12(5-7-13)9-22-10-14-11-27-15-3-2-8-23-17(15)28-14;/h2-8,14,16,22,24H,9-11H2,1H3;1H/t14-,16-;/m0./s1
n/an/a 3.80n/an/an/an/an/an/a
Therachem Research Medilab (India) Pvt. Ltd.
Curated by ChEMBL
Assay Description
Inhibition of human MoGAT-2 expressed in human Caco2 cells assessed as inhibition of 2-O-Hexadecylglycerol hydrolysis pretreated for 30 mins by LC-MS...
ACS Med Chem Lett 5: 840-1 (2014)
Article DOI: 10.1021/ml500217g
BindingDB Entry DOI: 10.7270/Q2BZ67QZ