null
SMILES: NC(=N)c1ccc(cc1)C#Cc1ccc2C(=O)N(CC(O)=O)CCc2c1
InChI Key: InChIKey=VRDDPLTXVVJYHN-UHFFFAOYSA-N
Activity Spreadsheet -- Enzyme Inhibition Constant Data from BindingDB
Found 1 hit for monomerid = 50058924
Trg + Lig
Ki
nM
ΔG°
kcal/mole
IC50
nM
Kd
nM
EC50/IC50
nM
koff
s-1
kon
M-1s-1
pHTemp
°C
Integrin alpha-IIb/beta-3
(Homo sapiens (Human))
BDBM50058924
(CHEMBL68183 | [6-(4-Carbamimidoyl-phenylethynyl)-1...)
Show SMILES NC(=N)c1ccc(cc1)C#Cc1ccc2C(=O)N(CC(O)=O)CCc2c1
Show InChI InChI=1S/C20H17N3O3/c21-19(22)15-6-3-13(4-7-15)1-2-14-5-8-17-16(11-14)9-10-23(20(17)26)12-18(24)25/h3-8,11H,9-10,12H2,(H3,21,22)(H,24,25)
n/an/a 33n/an/an/an/an/an/a
Lilly Research Laboratories
Curated by ChEMBL
Assay Description
Concentration required to reduce binding of fibrinogen to purified Fibrinogen Receptor by 50% using ELISA
J Med Chem 40: 2085-101 (1997)
Article DOI: 10.1021/jm9701076
BindingDB Entry DOI: 10.7270/Q23T9GBH