BDBM50059063 1-{4-[(Benzo[1,3]dioxol-5-ylmethyl)-amino]-6-chloro-quinazolin-2-yl}-piperidine-4-carboxylic acid::CHEMBL70569
SMILES: OC(=O)C1CCN(CC1)c1nc(NCc2ccc3OCOc3c2)c2cc(Cl)ccc2n1
InChI Key: InChIKey=QUUJQFQTLSFCKW-UHFFFAOYSA-N
Data: 3 IC50
Activity Spreadsheet -- Enzyme Inhibition Constant Data from BindingDB
Found 3 hits for monomerid = 50059063
Trg + Lig
Ki
nM
ΔG°
kcal/mole
IC50
nM
Kd
nM
EC50/IC50
nM
koff
s-1
kon
M-1s-1
pHTemp
°C
Heart phosphodiesterase
(Bos taurus)
BDBM50059063
(1-{4-[(Benzo[1,3]dioxol-5-ylmethyl)-amino]-6-chlor...)
Show SMILES OC(=O)C1CCN(CC1)c1nc(NCc2ccc3OCOc3c2)c2cc(Cl)ccc2n1
Show InChI InChI=1S/C22H21ClN4O4/c23-15-2-3-17-16(10-15)20(24-11-13-1-4-18-19(9-13)31-12-30-18)26-22(25-17)27-7-5-14(6-8-27)21(28)29/h1-4,9-10,14H,5-8,11-12H2,(H,28,29)(H,24,25,26)
n/an/a>1.00E+5n/an/an/an/an/an/a
Schering-Plough Research Institute
Curated by ChEMBL
Assay Description
Inhibitory activity against phosphodiesterase 3 (PDE3) purified from bovine heart
J Med Chem 40: 2196-210 (1997)
Article DOI: 10.1021/jm9608467
BindingDB Entry DOI: 10.7270/Q2G44PFZ
Phosphodiesterase 2A
(Bos taurus)
BDBM50059063
(1-{4-[(Benzo[1,3]dioxol-5-ylmethyl)-amino]-6-chlor...)
Show SMILES OC(=O)C1CCN(CC1)c1nc(NCc2ccc3OCOc3c2)c2cc(Cl)ccc2n1
Show InChI InChI=1S/C22H21ClN4O4/c23-15-2-3-17-16(10-15)20(24-11-13-1-4-18-19(9-13)31-12-30-18)26-22(25-17)27-7-5-14(6-8-27)21(28)29/h1-4,9-10,14H,5-8,11-12H2,(H,28,29)(H,24,25,26)
n/an/a 1.09E+4n/an/an/an/an/an/a
Schering-Plough Research Institute
Curated by ChEMBL
Assay Description
Inhibition of recombinant bovine adrenal cortex Phosphodiesterase 2 (PDE2)
J Med Chem 40: 2196-210 (1997)
Article DOI: 10.1021/jm9608467
BindingDB Entry DOI: 10.7270/Q2G44PFZ
Phosphodiesterase 5A
(Bos taurus)
BDBM50059063
(1-{4-[(Benzo[1,3]dioxol-5-ylmethyl)-amino]-6-chlor...)
Show SMILES OC(=O)C1CCN(CC1)c1nc(NCc2ccc3OCOc3c2)c2cc(Cl)ccc2n1
Show InChI InChI=1S/C22H21ClN4O4/c23-15-2-3-17-16(10-15)20(24-11-13-1-4-18-19(9-13)31-12-30-18)26-22(25-17)27-7-5-14(6-8-27)21(28)29/h1-4,9-10,14H,5-8,11-12H2,(H,28,29)(H,24,25,26)
Reactome pathway
n/an/a 4n/an/an/an/an/an/a
Schering-Plough Research Institute
Curated by ChEMBL
Assay Description
Evaluated for inhibitory activity against Phosphodiesterase 5 (PDE5) purified from bovine lung
J Med Chem 40: 2196-210 (1997)
Article DOI: 10.1021/jm9608467
BindingDB Entry DOI: 10.7270/Q2G44PFZ