null
SMILES: CNC(=O)c1ccccc1Nc1nc(Nc2ccc(CNC(=O)OC=C)cc2)n2ccnc2n1
InChI Key: InChIKey=JDLNEGRABVBCLK-UHFFFAOYSA-N
Activity Spreadsheet -- Enzyme Inhibition Constant Data from BindingDB
Found 1 hit for monomerid = 50059147
Trg + Lig
Ki
nM
ΔG°
kcal/mole
IC50
nM
Kd
nM
EC50/IC50
nM
koff
s-1
kon
M-1s-1
pHTemp
°C
Focal adhesion kinase 1
(Homo sapiens (Human))
BDBM50059147
(CHEMBL3393281)
Show SMILES CNC(=O)c1ccccc1Nc1nc(Nc2ccc(CNC(=O)OC=C)cc2)n2ccnc2n1
Show InChI InChI=1S/C23H22N8O3/c1-3-34-23(33)26-14-15-8-10-16(11-9-15)27-22-30-20(29-21-25-12-13-31(21)22)28-18-7-5-4-6-17(18)19(32)24-2/h3-13H,1,14H2,2H3,(H,24,32)(H,26,33)(H2,25,27,28,29,30)
NCI pathway
Reactome pathway
n/an/a 880n/an/an/an/an/an/a
Universit£ Paris Descartes
Curated by ChEMBL
Assay Description
Inhibition of FAK (unknown origin) using ULight-poly GT as substrate after 1.6 hrs by TR-FRET assay
J Med Chem 58: 237-51 (2015)
Article DOI: 10.1021/jm500784e
BindingDB Entry DOI: 10.7270/Q2B27WZC