null
SMILES: CNC(=O)c1ccccc1Nc1nc(Nc2ccc(cc2)C#N)nc2nccn12
InChI Key: InChIKey=KEJWKRVOIZVWTH-UHFFFAOYSA-N
Activity Spreadsheet -- Enzyme Inhibition Constant Data from BindingDB
Found 1 hit for monomerid = 50059154
Trg + Lig
Ki
nM
ΔG°
kcal/mole
IC50
nM
Kd
nM
EC50/IC50
nM
koff
s-1
kon
M-1s-1
pHTemp
°C
Focal adhesion kinase 1
(Homo sapiens (Human))
BDBM50059154
(CHEMBL3393274)
Show SMILES CNC(=O)c1ccccc1Nc1nc(Nc2ccc(cc2)C#N)nc2nccn12
Show InChI InChI=1S/C20H16N8O/c1-22-17(29)15-4-2-3-5-16(15)25-20-27-18(26-19-23-10-11-28(19)20)24-14-8-6-13(12-21)7-9-14/h2-11H,1H3,(H,22,29)(H2,23,24,25,26,27)
NCI pathway
Reactome pathway
n/an/a 710n/an/an/an/an/an/a
Universit£ Paris Descartes
Curated by ChEMBL
Assay Description
Inhibition of FAK (unknown origin) using ULight-poly GT as substrate after 1.6 hrs by TR-FRET assay
J Med Chem 58: 237-51 (2015)
Article DOI: 10.1021/jm500784e
BindingDB Entry DOI: 10.7270/Q2B27WZC