null
SMILES: CNC(=O)c1ccccc1Nc1nc(Nc2ccc(cc2OC)N2CCOCC2)n2ccnc2n1
InChI Key: InChIKey=YMFLRYOELCBVBK-UHFFFAOYSA-N
Activity Spreadsheet -- Enzyme Inhibition Constant Data from BindingDB
Found 1 hit for monomerid = 50059155
Trg + Lig
Ki
nM
ΔG°
kcal/mole
IC50
nM
Kd
nM
EC50/IC50
nM
koff
s-1
kon
M-1s-1
pHTemp
°C
Focal adhesion kinase 1
(Homo sapiens (Human))
BDBM50059155
(CHEMBL3393273)
Show SMILES CNC(=O)c1ccccc1Nc1nc(Nc2ccc(cc2OC)N2CCOCC2)n2ccnc2n1
Show InChI InChI=1S/C24H26N8O3/c1-25-21(33)17-5-3-4-6-18(17)27-22-29-23-26-9-10-32(23)24(30-22)28-19-8-7-16(15-20(19)34-2)31-11-13-35-14-12-31/h3-10,15H,11-14H2,1-2H3,(H,25,33)(H2,26,27,28,29,30)
NCI pathway
Reactome pathway
n/an/a 510n/an/an/an/an/an/a
Universit£ Paris Descartes
Curated by ChEMBL
Assay Description
Inhibition of FAK (unknown origin) using ULight-poly GT as substrate after 1.6 hrs by TR-FRET assay
J Med Chem 58: 237-51 (2015)
Article DOI: 10.1021/jm500784e
BindingDB Entry DOI: 10.7270/Q2B27WZC