null
SMILES: CC(C)(C#N)c1cc(Nc2cc(ccn2)C#N)nc(c1)N1CCC(F)(F)C1
InChI Key: InChIKey=OZCJURDLKWBQAU-UHFFFAOYSA-N
Activity Spreadsheet -- Enzyme Inhibition Constant Data from BindingDB
Found 2 hits for monomerid = 50059199
Trg + Lig
Ki
nM
ΔG°
kcal/mole
IC50
nM
Kd
nM
EC50/IC50
nM
koff
s-1
kon
M-1s-1
pHTemp
°C
Mitogen-activated protein kinase kinase kinase 12
(Homo sapiens (Human))
BDBM50059199
(CHEMBL3393331)
Show SMILES CC(C)(C#N)c1cc(Nc2cc(ccn2)C#N)nc(c1)N1CCC(F)(F)C1
Show InChI InChI=1S/C19H18F2N6/c1-18(2,11-23)14-8-16(25-15-7-13(10-22)3-5-24-15)26-17(9-14)27-6-4-19(20,21)12-27/h3,5,7-9H,4,6,12H2,1-2H3,(H,24,25,26)
14n/an/an/an/an/an/an/an/a
Genentech
Curated by ChEMBL
Assay Description
Inhibition of DLK (unknown origin)
J Med Chem 58: 401-18 (2015)
Article DOI: 10.1021/jm5013984
BindingDB Entry DOI: 10.7270/Q22J6DJ5
Mitogen-activated protein kinase kinase kinase 12
(Homo sapiens (Human))
BDBM50059199
(CHEMBL3393331)
Show SMILES CC(C)(C#N)c1cc(Nc2cc(ccn2)C#N)nc(c1)N1CCC(F)(F)C1
Show InChI InChI=1S/C19H18F2N6/c1-18(2,11-23)14-8-16(25-15-7-13(10-22)3-5-24-15)26-17(9-14)27-6-4-19(20,21)12-27/h3,5,7-9H,4,6,12H2,1-2H3,(H,24,25,26)
n/an/a 193n/an/an/an/an/an/a
Genentech
Curated by ChEMBL
Assay Description
Inhibition of human DLK transfected in HEK293 cells assessed as JNK phosphorylation after 5.5 hrs by Hoechst-33342 staining-based assay
J Med Chem 58: 401-18 (2015)
Article DOI: 10.1021/jm5013984
BindingDB Entry DOI: 10.7270/Q22J6DJ5