BDBM50059203 CHEMBL3393324
SMILES: CC(=O)N1CCC(CC1)c1cc(Nc2cc(ccn2)C(F)(F)F)nc(n1)N1CCC(F)(F)C1
InChI Key: InChIKey=JAXBPMVTQNGQOE-UHFFFAOYSA-N
Data: 1 KI  1 IC50
Activity Spreadsheet -- Enzyme Inhibition Constant Data from BindingDB
Found 2 hits for monomerid = 50059203
Trg + Lig
Ki
nM
ΔG°
kcal/mole
IC50
nM
Kd
nM
EC50/IC50
nM
koff
s-1
kon
M-1s-1
pHTemp
°C
Mitogen-activated protein kinase kinase kinase 12
(Homo sapiens (Human))
BDBM50059203
(CHEMBL3393324)
Show SMILES CC(=O)N1CCC(CC1)c1cc(Nc2cc(ccn2)C(F)(F)F)nc(n1)N1CCC(F)(F)C1
Show InChI InChI=1S/C21H23F5N6O/c1-13(33)31-7-3-14(4-8-31)16-11-18(29-17-10-15(2-6-27-17)21(24,25)26)30-19(28-16)32-9-5-20(22,23)12-32/h2,6,10-11,14H,3-5,7-9,12H2,1H3,(H,27,28,29,30)
33n/an/an/an/an/an/an/an/a
Genentech
Curated by ChEMBL
Assay Description
Inhibition of DLK (unknown origin)
J Med Chem 58: 401-18 (2015)
Article DOI: 10.1021/jm5013984
BindingDB Entry DOI: 10.7270/Q22J6DJ5
Mitogen-activated protein kinase kinase kinase 12
(Homo sapiens (Human))
BDBM50059203
(CHEMBL3393324)
Show SMILES CC(=O)N1CCC(CC1)c1cc(Nc2cc(ccn2)C(F)(F)F)nc(n1)N1CCC(F)(F)C1
Show InChI InChI=1S/C21H23F5N6O/c1-13(33)31-7-3-14(4-8-31)16-11-18(29-17-10-15(2-6-27-17)21(24,25)26)30-19(28-16)32-9-5-20(22,23)12-32/h2,6,10-11,14H,3-5,7-9,12H2,1H3,(H,27,28,29,30)
n/an/a 300n/an/an/an/an/an/a
Genentech
Curated by ChEMBL
Assay Description
Inhibition of human DLK transfected in HEK293 cells assessed as JNK phosphorylation after 5.5 hrs by Hoechst-33342 staining-based assay
J Med Chem 58: 401-18 (2015)
Article DOI: 10.1021/jm5013984
BindingDB Entry DOI: 10.7270/Q22J6DJ5