BDBM50059208 CHEMBL3393318
SMILES: COc1ccnc(Nc2cc(nc(C)n2)C2CCCN(C2)C(=O)c2ccccc2)c1
InChI Key: InChIKey=SUZLQCNSEYYNFG-UHFFFAOYSA-N
Data: 1 KI  1 IC50
Activity Spreadsheet -- Enzyme Inhibition Constant Data from BindingDB
Found 2 hits for monomerid = 50059208
Trg + Lig
Ki
nM
ΔG°
kcal/mole
IC50
nM
Kd
nM
EC50/IC50
nM
koff
s-1
kon
M-1s-1
pHTemp
°C
Mitogen-activated protein kinase kinase kinase 12
(Homo sapiens (Human))
BDBM50059208
(CHEMBL3393318)
Show SMILES COc1ccnc(Nc2cc(nc(C)n2)C2CCCN(C2)C(=O)c2ccccc2)c1
Show InChI InChI=1S/C23H25N5O2/c1-16-25-20(14-22(26-16)27-21-13-19(30-2)10-11-24-21)18-9-6-12-28(15-18)23(29)17-7-4-3-5-8-17/h3-5,7-8,10-11,13-14,18H,6,9,12,15H2,1-2H3,(H,24,25,26,27)
57n/an/an/an/an/an/an/an/a
Genentech
Curated by ChEMBL
Assay Description
Inhibition of DLK (unknown origin)
J Med Chem 58: 401-18 (2015)
Article DOI: 10.1021/jm5013984
BindingDB Entry DOI: 10.7270/Q22J6DJ5
Mitogen-activated protein kinase kinase kinase 12
(Homo sapiens (Human))
BDBM50059208
(CHEMBL3393318)
Show SMILES COc1ccnc(Nc2cc(nc(C)n2)C2CCCN(C2)C(=O)c2ccccc2)c1
Show InChI InChI=1S/C23H25N5O2/c1-16-25-20(14-22(26-16)27-21-13-19(30-2)10-11-24-21)18-9-6-12-28(15-18)23(29)17-7-4-3-5-8-17/h3-5,7-8,10-11,13-14,18H,6,9,12,15H2,1-2H3,(H,24,25,26,27)
n/an/a 1.00E+3n/an/an/an/an/an/a
Genentech
Curated by ChEMBL
Assay Description
Inhibition of human DLK transfected in HEK293 cells assessed as JNK phosphorylation after 5.5 hrs by Hoechst-33342 staining-based assay
J Med Chem 58: 401-18 (2015)
Article DOI: 10.1021/jm5013984
BindingDB Entry DOI: 10.7270/Q22J6DJ5