BDBM50059309 CHEMBL3393446
SMILES: N#CCC1CN(CCO1)c1ncnc2[nH]cc(-c3cccc(c3)C#N)c12
InChI Key: InChIKey=OVLGSAZYDZSQMN-UHFFFAOYSA-N
Data: 3 IC50
Activity Spreadsheet -- Enzyme Inhibition Constant Data from BindingDB
Found 3 hits for monomerid = 50059309
Trg + Lig
Ki
nM
ΔG°
kcal/mole
IC50
nM
Kd
nM
EC50/IC50
nM
koff
s-1
kon
M-1s-1
pHTemp
°C
Serine/threonine-protein kinase MST2
(Homo sapiens (Human))
BDBM50059309
(CHEMBL3393446)
Show SMILES N#CCC1CN(CCO1)c1ncnc2[nH]cc(-c3cccc(c3)C#N)c12
Show InChI InChI=1S/C19H16N6O/c20-5-4-15-11-25(6-7-26-15)19-17-16(10-22-18(17)23-12-24-19)14-3-1-2-13(8-14)9-21/h1-3,8,10,12,15H,4,6-7,11H2,(H,22,23,24)
Reactome pathway
n/an/a 196n/an/an/an/an/an/a
Pfizer Inc.
Curated by ChEMBL
Assay Description
Inhibition of human recombinant MST2 using Ser/Thr peptide 7 substrate after 45 mins by Z-Lyte assay
J Med Chem 58: 419-32 (2015)
Article DOI: 10.1021/jm5014055
BindingDB Entry DOI: 10.7270/Q2XS5X2W
Leucine-rich repeat serine/threonine-protein kinase 2 (LRRK2)
(Homo sapiens (Human))
BDBM50059309
(CHEMBL3393446)
Show SMILES N#CCC1CN(CCO1)c1ncnc2[nH]cc(-c3cccc(c3)C#N)c12
Show InChI InChI=1S/C19H16N6O/c20-5-4-15-11-25(6-7-26-15)19-17-16(10-22-18(17)23-12-24-19)14-3-1-2-13(8-14)9-21/h1-3,8,10,12,15H,4,6-7,11H2,(H,22,23,24)
n/an/a 5n/an/an/an/an/an/a
Pfizer Inc.
Curated by ChEMBL
Assay Description
Inhibition of GST-tagged truncated human recombinant LRRK2 using fluorescein-labeled LRRKtide peptide substrate incubated for 2 hrs
J Med Chem 58: 419-32 (2015)
Article DOI: 10.1021/jm5014055
BindingDB Entry DOI: 10.7270/Q2XS5X2W
Leucine-rich repeat serine/threonine-protein kinase 2 (LRRK2)
(Homo sapiens (Human))
BDBM50059309
(CHEMBL3393446)
Show SMILES N#CCC1CN(CCO1)c1ncnc2[nH]cc(-c3cccc(c3)C#N)c12
Show InChI InChI=1S/C19H16N6O/c20-5-4-15-11-25(6-7-26-15)19-17-16(10-22-18(17)23-12-24-19)14-3-1-2-13(8-14)9-21/h1-3,8,10,12,15H,4,6-7,11H2,(H,22,23,24)
n/an/a 117n/an/an/an/an/an/a
Pfizer Inc.
Curated by ChEMBL
Assay Description
Inhibition of full length LRRK2 (unknown origin) expressed in HEK293 cells assessed as reduction in S935 phosphorylation incubated for 90 mins by ELI...
J Med Chem 58: 419-32 (2015)
Article DOI: 10.1021/jm5014055
BindingDB Entry DOI: 10.7270/Q2XS5X2W