BDBM50059449 CHEMBL3393478
SMILES: CCOC(=O)c1[nH]cc2C(c3ccc(Sc4nc5c(F)c(F)c(F)cc5[nH]4)o3)C3=C(CCCC3=O)Nc12
InChI Key:
Data: 3 IC50
Activity Spreadsheet -- Enzyme Inhibition Constant Data from BindingDB
Found 3 hits for monomerid = 50059449
Trg + Lig
Ki
nM
ΔG°
kcal/mole
IC50
nM
Kd
nM
EC50/IC50
nM
koff
s-1
kon
M-1s-1
pHTemp
°C
Aurora kinase B
(Homo sapiens (Human))
BDBM50059449
(CHEMBL3393478)
Show SMILES CCOC(=O)c1[nH]cc2C(c3ccc(Sc4nc5c(F)c(F)c(F)cc5[nH]4)o3)C3=C(CCCC3=O)Nc12 |t:31|
Reactome pathway
n/an/a 7n/an/an/an/an/an/a
Sanofi
Curated by ChEMBL
Assay Description
Inhibition of poly-histidine tagged full length recombinant aurora B (unknown origin) assessed as phosphorylation of NuMA-histidine substrate by scin...
J Med Chem 58: 362-75 (2015)
Article DOI: 10.1021/jm501326k
BindingDB Entry DOI: 10.7270/Q2T1559D
Cytochrome P450 3A4
(Homo sapiens (Human))
BDBM50059449
(CHEMBL3393478)
Show SMILES CCOC(=O)c1[nH]cc2C(c3ccc(Sc4nc5c(F)c(F)c(F)cc5[nH]4)o3)C3=C(CCCC3=O)Nc12 |t:31|
Reactome pathway
n/an/a 2.30E+4n/an/an/an/an/an/a
Sanofi
Curated by ChEMBL
Assay Description
Inhibition of human recombinant CYP3A4 co-expressed with human P450 reductase/human b5 reductase using 7-benzyloxyquinoline substrate
J Med Chem 58: 362-75 (2015)
Article DOI: 10.1021/jm501326k
BindingDB Entry DOI: 10.7270/Q2T1559D
Aurora kinase A
(Homo sapiens (Human))
BDBM50059449
(CHEMBL3393478)
Show SMILES CCOC(=O)c1[nH]cc2C(c3ccc(Sc4nc5c(F)c(F)c(F)cc5[nH]4)o3)C3=C(CCCC3=O)Nc12 |t:31|
NCI pathway
Reactome pathway
n/an/a 22n/an/an/an/an/an/a
Sanofi
Curated by ChEMBL
Assay Description
Inhibition of poly-histidine tagged full length recombinant aurora A (unknown origin) assessed as phosphorylation of NuMA-histidine substrate by scin...
J Med Chem 58: 362-75 (2015)
Article DOI: 10.1021/jm501326k
BindingDB Entry DOI: 10.7270/Q2T1559D