BDBM50059489 CHEMBL3393456
SMILES: Clc1cc(Cl)cc(Oc2cccc(c2)C2c3c[nH]nc3NC3=C2C(=O)CNC3)c1
InChI Key:
Data: 1 IC50
Activity Spreadsheet -- Enzyme Inhibition Constant Data from BindingDB
Found 1 hit for monomerid = 50059489
Trg + Lig
Ki
nM
ΔG°
kcal/mole
IC50
nM
Kd
nM
EC50/IC50
nM
koff
s-1
kon
M-1s-1
pHTemp
°C
Aurora kinase A
(Homo sapiens (Human))
BDBM50059489
(CHEMBL3393456)
Show SMILES Clc1cc(Cl)cc(Oc2cccc(c2)C2c3c[nH]nc3NC3=C2C(=O)CNC3)c1 |c:23|
NCI pathway
Reactome pathway
n/an/a 300n/an/an/an/an/an/a
Sanofi
Curated by ChEMBL
Assay Description
Inhibition of poly-histidine tagged full length recombinant aurora A (unknown origin) assessed as phosphorylation of NuMA-histidine substrate by scin...
J Med Chem 58: 362-75 (2015)
Article DOI: 10.1021/jm501326k
BindingDB Entry DOI: 10.7270/Q2T1559D