BDBM50059597 CHEMBL3393502
SMILES: Oc1ccc2nc(nc(N3CCOCC3)c2c1)-c1ccccc1
InChI Key: InChIKey=GOCYUTRHNPXKRQ-UHFFFAOYSA-N
Data: 1 IC50
Activity Spreadsheet -- Enzyme Inhibition Constant Data from BindingDB
Found 1 hit for monomerid = 50059597
Trg + Lig
Ki
nM
ΔG°
kcal/mole
IC50
nM
Kd
nM
EC50/IC50
nM
koff
s-1
kon
M-1s-1
pHTemp
°C
Phosphatidylinositol 4,5-bisphosphate 3-kinase catalytic subunit alpha isoform
(Homo sapiens (Human))
BDBM50059597
(CHEMBL3393502)
Show SMILES Oc1ccc2nc(nc(N3CCOCC3)c2c1)-c1ccccc1
Show InChI InChI=1S/C18H17N3O2/c22-14-6-7-16-15(12-14)18(21-8-10-23-11-9-21)20-17(19-16)13-4-2-1-3-5-13/h1-7,12,22H,8-11H2
NCI pathway
Reactome pathway
n/an/a 1.30E+3n/an/an/an/an/an/a
University Hospital Hradec Kralove
Curated by ChEMBL
Assay Description
Inhibition of PI3K p110alpha (unknown origin)
J Med Chem 58: 41-71 (2015)
Article DOI: 10.1021/jm501026z
BindingDB Entry DOI: 10.7270/Q2P84DJ7