BDBM50059604 4-(1,8-Dihydroxy-9-oxo-9,10-dihydro-anthracen-2-yl)-N-hydroxy-N-methyl-butyramide::CHEMBL96402
SMILES: CN(O)C(=O)CCCc1ccc2Cc3cccc(O)c3C(=O)c2c1O
InChI Key: InChIKey=GKNZLRDDKGJSJQ-UHFFFAOYSA-N
Data: 1 IC50
Activity Spreadsheet -- Enzyme Inhibition Constant Data from BindingDB
Found 1 hit for monomerid = 50059604
Trg + Lig
Ki
nM
ΔG°
kcal/mole
IC50
nM
Kd
nM
EC50/IC50
nM
koff
s-1
kon
M-1s-1
pHTemp
°C
Arachidonate 5-lipoxygenase
(Bos taurus)
BDBM50059604
(4-(1,8-Dihydroxy-9-oxo-9,10-dihydro-anthracen-2-yl...)
Show SMILES CN(O)C(=O)CCCc1ccc2Cc3cccc(O)c3C(=O)c2c1O
Show InChI InChI=1S/C19H19NO5/c1-20(25)15(22)7-3-4-11-8-9-13-10-12-5-2-6-14(21)16(12)19(24)17(13)18(11)23/h2,5-6,8-9,21,23,25H,3-4,7,10H2,1H3
Reactome pathway
n/an/a 600n/an/an/an/an/an/a
Westfälische Wilhelms-Universität Münster
Curated by ChEMBL
Assay Description
5-LO inhibitory activity, measured by production of 5-hydroxyeicosatetraenoic acid (5-HETE) and leukotriene B4 (LTB4) in bovine polymorphonuclear leu...
J Med Chem 40: 2780-7 (1997)
Article DOI: 10.1021/jm9701785
BindingDB Entry DOI: 10.7270/Q28C9VB4