BDBM50059608 5-(1,8-Dihydroxy-9-oxo-9,10-dihydro-anthracen-2-yl)-pentanoic acid hydroxy-methyl-amide::CHEMBL96598
SMILES: CN(O)C(=O)CCCCc1ccc2Cc3cccc(O)c3C(=O)c2c1O
InChI Key: InChIKey=ZWOYICPUYHRHKG-UHFFFAOYSA-N
Data: 1 IC50
Activity Spreadsheet -- Enzyme Inhibition Constant Data from BindingDB
Found 1 hit for monomerid = 50059608
Trg + Lig
Ki
nM
ΔG°
kcal/mole
IC50
nM
Kd
nM
EC50/IC50
nM
koff
s-1
kon
M-1s-1
pHTemp
°C
Arachidonate 5-lipoxygenase
(Bos taurus)
BDBM50059608
(5-(1,8-Dihydroxy-9-oxo-9,10-dihydro-anthracen-2-yl...)
Show SMILES CN(O)C(=O)CCCCc1ccc2Cc3cccc(O)c3C(=O)c2c1O
Show InChI InChI=1S/C20H21NO5/c1-21(26)16(23)8-3-2-5-12-9-10-14-11-13-6-4-7-15(22)17(13)20(25)18(14)19(12)24/h4,6-7,9-10,22,24,26H,2-3,5,8,11H2,1H3
Reactome pathway
n/an/a 500n/an/an/an/an/an/a
Westfälische Wilhelms-Universität Münster
Curated by ChEMBL
Assay Description
5-LO inhibitory activity, measured by production of 5-hydroxyeicosatetraenoic acid (5-HETE) and leukotriene B4 (LTB4) in bovine polymorphonuclear leu...
J Med Chem 40: 2780-7 (1997)
Article DOI: 10.1021/jm9701785
BindingDB Entry DOI: 10.7270/Q28C9VB4