BDBM50059611 4-(1,8-Dihydroxy-9-oxo-9,10-dihydro-anthracene-2-carbonyl)-benzoic acid methyl ester::CHEMBL93818
SMILES: COC(=O)c1ccc(cc1)C(=O)c1ccc2Cc3cccc(O)c3C(=O)c2c1O
InChI Key: InChIKey=XCJIWWFRCQOJJD-UHFFFAOYSA-N
Data: 1 IC50
Activity Spreadsheet -- Enzyme Inhibition Constant Data from BindingDB
Found 1 hit for monomerid = 50059611
Trg + Lig
Ki
nM
ΔG°
kcal/mole
IC50
nM
Kd
nM
EC50/IC50
nM
koff
s-1
kon
M-1s-1
pHTemp
°C
Arachidonate 5-lipoxygenase
(Bos taurus)
BDBM50059611
(4-(1,8-Dihydroxy-9-oxo-9,10-dihydro-anthracene-2-c...)
Show SMILES COC(=O)c1ccc(cc1)C(=O)c1ccc2Cc3cccc(O)c3C(=O)c2c1O
Show InChI InChI=1S/C23H16O6/c1-29-23(28)13-7-5-12(6-8-13)20(25)16-10-9-15-11-14-3-2-4-17(24)18(14)22(27)19(15)21(16)26/h2-10,24,26H,11H2,1H3
Reactome pathway
n/an/a>3.00E+4n/an/an/an/an/an/a
Westfälische Wilhelms-Universität Münster
Curated by ChEMBL
Assay Description
5-LO inhibitory activity, measured by production of 5-hydroxyeicosatetraenoic acid (5-HETE) and leukotriene B4 (LTB4) in bovine polymorphonuclear leu...
J Med Chem 40: 2780-7 (1997)
Article DOI: 10.1021/jm9701785
BindingDB Entry DOI: 10.7270/Q28C9VB4