BDBM50059614 6-(1,8-Dihydroxy-9-oxo-9,10-dihydro-anthracen-2-yl)-hexanoic acid::CHEMBL92297
SMILES: OC(=O)CCCCCc1ccc2Cc3cccc(O)c3C(=O)c2c1O
InChI Key: InChIKey=BWXJMOYFKMBTFQ-UHFFFAOYSA-N
Data: 1 IC50
Activity Spreadsheet -- Enzyme Inhibition Constant Data from BindingDB
Found 1 hit for monomerid = 50059614
Trg + Lig
Ki
nM
ΔG°
kcal/mole
IC50
nM
Kd
nM
EC50/IC50
nM
koff
s-1
kon
M-1s-1
pHTemp
°C
Arachidonate 5-lipoxygenase
(Bos taurus)
BDBM50059614
(6-(1,8-Dihydroxy-9-oxo-9,10-dihydro-anthracen-2-yl...)
Show SMILES OC(=O)CCCCCc1ccc2Cc3cccc(O)c3C(=O)c2c1O
Show InChI InChI=1S/C20H20O5/c21-15-7-4-6-13-11-14-10-9-12(5-2-1-3-8-16(22)23)19(24)18(14)20(25)17(13)15/h4,6-7,9-10,21,24H,1-3,5,8,11H2,(H,22,23)
Reactome pathway
n/an/a 1.00E+4n/an/an/an/an/an/a
Westfälische Wilhelms-Universität Münster
Curated by ChEMBL
Assay Description
5-LO inhibitory activity, measured by production of 5-hydroxyeicosatetraenoic acid (5-HETE) and leukotriene B4 (LTB4) in bovine polymorphonuclear leu...
J Med Chem 40: 2780-7 (1997)
Article DOI: 10.1021/jm9701785
BindingDB Entry DOI: 10.7270/Q28C9VB4