BDBM50059704 7-[(5-Carbamimidoyl-1H-indole-2-carbonyl)-methyl-amino]-heptanoic acid::CHEMBL95826
SMILES: CN(CCCCCCC(O)=O)C(=O)c1cc2cc(ccc2[nH]1)C(N)=N
InChI Key: InChIKey=NANJNFBIFRTABD-UHFFFAOYSA-N
Data: 2 IC50
Activity Spreadsheet -- Enzyme Inhibition Constant Data from BindingDB
Found 2 hits for monomerid = 50059704
Trg + Lig
Ki
nM
ΔG°
kcal/mole
IC50
nM
Kd
nM
EC50/IC50
nM
koff
s-1
kon
M-1s-1
pHTemp
°C
Integrin alpha-IIb/beta-3
(Homo sapiens (Human))
BDBM50059704
(7-[(5-Carbamimidoyl-1H-indole-2-carbonyl)-methyl-a...)
Show SMILES CN(CCCCCCC(O)=O)C(=O)c1cc2cc(ccc2[nH]1)C(N)=N
Show InChI InChI=1S/C18H24N4O3/c1-22(9-5-3-2-4-6-16(23)24)18(25)15-11-13-10-12(17(19)20)7-8-14(13)21-15/h7-8,10-11,21H,2-6,9H2,1H3,(H3,19,20)(H,23,24)
n/an/a 340n/an/an/an/an/an/a
Lilly Research Laboratories
Curated by ChEMBL
Assay Description
Antagonism of fibrinogen binding to a purified human fibrinogen receptor preparation.
J Med Chem 40: 2843-57 (1997)
Article DOI: 10.1021/jm970020k
BindingDB Entry DOI: 10.7270/Q24M93MS
Integrin alpha-IIb/beta-3
(Homo sapiens (Human))
BDBM50059704
(7-[(5-Carbamimidoyl-1H-indole-2-carbonyl)-methyl-a...)
Show SMILES CN(CCCCCCC(O)=O)C(=O)c1cc2cc(ccc2[nH]1)C(N)=N
Show InChI InChI=1S/C18H24N4O3/c1-22(9-5-3-2-4-6-16(23)24)18(25)15-11-13-10-12(17(19)20)7-8-14(13)21-15/h7-8,10-11,21H,2-6,9H2,1H3,(H3,19,20)(H,23,24)
n/an/a 3.00E+3n/an/an/an/an/an/a
Lilly Research Laboratories
Curated by ChEMBL
Assay Description
Inhibition of the platelet GPIIb-IIIa receptor measured as ability to attenuate ADP-induced (fibrinogen-mediated) platelet aggregation in human plate...
J Med Chem 40: 2843-57 (1997)
Article DOI: 10.1021/jm970020k
BindingDB Entry DOI: 10.7270/Q24M93MS