BDBM50060162 (S)-2-[[3-Azido-5-(5-methyl-2,4-dioxo-3,4-dihydro-2H-pyrimidin-1-yl)-tetrahydro-furan-2-ylmethoxy]-(2-cyano-ethoxy)-phosphorylamino]-3-phenyl-propionic acid methyl ester::CHEMBL432520
SMILES: COC(=O)[C@H](Cc1ccccc1)NP(=O)(OCCC#N)OCC1OC(CC1N=[N+]=[N-])n1cc(C)c(=O)[nH]c1=O
InChI Key: InChIKey=GQOOHDGGHYGHFS-UWTAPUMBSA-N
Data: 1 IC50
Activity Spreadsheet -- Enzyme Inhibition Constant Data from BindingDB
Found 1 hit for monomerid = 50060162
Trg + Lig
Ki
nM
ΔG°
kcal/mole
IC50
nM
Kd
nM
EC50/IC50
nM
koff
s-1
kon
M-1s-1
pHTemp
°C
Human immunodeficiency virus type 1 reverse transcriptase
(Human immunodeficiency virus 1)
BDBM50060162
((S)-2-[[3-Azido-5-(5-methyl-2,4-dioxo-3,4-dihydro-...)
Show SMILES COC(=O)[C@H](Cc1ccccc1)NP(=O)(OCCC#N)OCC1OC(CC1N=[N+]=[N-])n1cc(C)c(=O)[nH]c1=O
Show InChI InChI=1S/C23H28N7O8P/c1-15-13-30(23(33)26-21(15)31)20-12-17(27-29-25)19(38-20)14-37-39(34,36-10-6-9-24)28-18(22(32)35-2)11-16-7-4-3-5-8-16/h3-5,7-8,13,17-20H,6,10-12,14H2,1-2H3,(H,28,34)(H,26,31,33)/t17?,18-,19?,20?,39?/m0/s1
n/an/a>1.00E+5n/an/an/an/an/an/a
TBA
Curated by ChEMBL
Assay Description
Tested for the inhibition of the compound towards HIV-reverse transcriptase
Bioorg Med Chem Lett 5: 1819-1824 (1995)
Article DOI: 10.1016/0960-894X(95)00302-A
BindingDB Entry DOI: 10.7270/Q23T9H64