BDBM50060483 7,8,9,10-Tetrahydro-6H-cyclohepta[b]quinolin-11-ylamine::7,8,9,10-tetrahydro-6H-cyclohepta[b]quinolin-11-amine::CHEMBL330883
SMILES: Nc1c2CCCCCc2nc2ccccc12
InChI Key: InChIKey=GOXLVSZAUDIXPN-UHFFFAOYSA-N
Data: 5 IC50
Activity Spreadsheet -- Enzyme Inhibition Constant Data from BindingDB
Found 5 hits for monomerid = 50060483
Trg + Lig
Ki
nM
ΔG°
kcal/mole
IC50
nM
Kd
nM
EC50/IC50
nM
koff
s-1
kon
M-1s-1
pHTemp
°C
Norepinephrine Monoamine transporters
(Rattus norvegicus)
BDBM50060483
(7,8,9,10-Tetrahydro-6H-cyclohepta[b]quinolin-11-yl...)
Show SMILES Nc1c2CCCCCc2nc2ccccc12
Show InChI InChI=1S/C14H16N2/c15-14-10-6-2-1-3-8-12(10)16-13-9-5-4-7-11(13)14/h4-5,7,9H,1-3,6,8H2,(H2,15,16)
Reactome pathway
n/an/a 6.90E+3n/an/an/an/an/an/a
University of Strathclyde
Curated by ChEMBL
Assay Description
Inhibition of neuronal uptake of Noradrenaline in rat brain homogenate
J Med Chem 40: 3516-23 (1997)
Article DOI: 10.1021/jm970150t
BindingDB Entry DOI: 10.7270/Q25H7FC9
Acetylcholinesterase
(Rattus norvegicus (rat))
BDBM50060483
(7,8,9,10-Tetrahydro-6H-cyclohepta[b]quinolin-11-yl...)
Show SMILES Nc1c2CCCCCc2nc2ccccc12
Show InChI InChI=1S/C14H16N2/c15-14-10-6-2-1-3-8-12(10)16-13-9-5-4-7-11(13)14/h4-5,7,9H,1-3,6,8H2,(H2,15,16)
n/an/a 39n/an/an/an/an/an/a
University of Strathclyde
Curated by ChEMBL
Assay Description
In vitro inhibition of acetylcholinesterase, isolated from rat brain.
J Med Chem 40: 3516-23 (1997)
Article DOI: 10.1021/jm970150t
BindingDB Entry DOI: 10.7270/Q25H7FC9
Acetylcholinesterase
(Homo sapiens (Human))
BDBM50060483
(7,8,9,10-Tetrahydro-6H-cyclohepta[b]quinolin-11-yl...)
Show SMILES Nc1c2CCCCCc2nc2ccccc12
Show InChI InChI=1S/C14H16N2/c15-14-10-6-2-1-3-8-12(10)16-13-9-5-4-7-11(13)14/h4-5,7,9H,1-3,6,8H2,(H2,15,16)
NCI pathway
Reactome pathway
n/an/a 39n/an/an/an/an/an/a
Sichuan University
Curated by ChEMBL
Assay Description
Inhibition of AChE
Eur J Med Chem 45: 1167-72 (2010)
Article DOI: 10.1016/j.ejmech.2009.12.038
BindingDB Entry DOI: 10.7270/Q25H7GFM
Cholinesterases
(Homo sapiens (Human))
BDBM50060483
(7,8,9,10-Tetrahydro-6H-cyclohepta[b]quinolin-11-yl...)
Show SMILES Nc1c2CCCCCc2nc2ccccc12
Show InChI InChI=1S/C14H16N2/c15-14-10-6-2-1-3-8-12(10)16-13-9-5-4-7-11(13)14/h4-5,7,9H,1-3,6,8H2,(H2,15,16)
Reactome pathway
n/an/a 14n/an/an/an/an/an/a
University of Strathclyde
Curated by ChEMBL
Assay Description
In vitro inhibition of Butyrylcholinesterase from human plasma.
J Med Chem 40: 3516-23 (1997)
Article DOI: 10.1021/jm970150t
BindingDB Entry DOI: 10.7270/Q25H7FC9
Sodium-dependent serotonin transporter
(Rattus norvegicus (rat))
BDBM50060483
(7,8,9,10-Tetrahydro-6H-cyclohepta[b]quinolin-11-yl...)
Show SMILES Nc1c2CCCCCc2nc2ccccc12
Show InChI InChI=1S/C14H16N2/c15-14-10-6-2-1-3-8-12(10)16-13-9-5-4-7-11(13)14/h4-5,7,9H,1-3,6,8H2,(H2,15,16)
n/an/a 3.60E+3n/an/an/an/an/an/a
University of Strathclyde
Curated by ChEMBL
Assay Description
Inhibition of neuronal uptake of 5 - Hydroxytryptamine in rat brain homogenate
J Med Chem 40: 3516-23 (1997)
Article DOI: 10.1021/jm970150t
BindingDB Entry DOI: 10.7270/Q25H7FC9