BDBM50060484 9-Amino-3-butyl-2-methyl-2,3-dihydro-1H-cyclopenta[b]quinolin-3-ol::CHEMBL119528
SMILES: CCCCC1(O)C(C)Cc2c1nc1ccccc1c2N
InChI Key: InChIKey=KAJOBKYNCXLYHH-UHFFFAOYSA-N
Data: 5 IC50
Activity Spreadsheet -- Enzyme Inhibition Constant Data from BindingDB
Found 5 hits for monomerid = 50060484
Trg + Lig
Ki
nM
ΔG°
kcal/mole
IC50
nM
Kd
nM
EC50/IC50
nM
koff
s-1
kon
M-1s-1
pHTemp
°C
Norepinephrine Monoamine transporters
(Rattus norvegicus)
BDBM50060484
(9-Amino-3-butyl-2-methyl-2,3-dihydro-1H-cyclopenta...)
Show SMILES CCCCC1(O)C(C)Cc2c1nc1ccccc1c2N
Show InChI InChI=1S/C17H22N2O/c1-3-4-9-17(20)11(2)10-13-15(18)12-7-5-6-8-14(12)19-16(13)17/h5-8,11,20H,3-4,9-10H2,1-2H3,(H2,18,19)
Reactome pathway
n/an/a 1.20E+4n/an/an/an/an/an/a
University of Strathclyde
Curated by ChEMBL
Assay Description
Inhibition of neuronal uptake of Noradrenaline in rat brain homogenate
J Med Chem 40: 3516-23 (1997)
Article DOI: 10.1021/jm970150t
BindingDB Entry DOI: 10.7270/Q25H7FC9
Acetylcholinesterase
(Rattus norvegicus (rat))
BDBM50060484
(9-Amino-3-butyl-2-methyl-2,3-dihydro-1H-cyclopenta...)
Show SMILES CCCCC1(O)C(C)Cc2c1nc1ccccc1c2N
Show InChI InChI=1S/C17H22N2O/c1-3-4-9-17(20)11(2)10-13-15(18)12-7-5-6-8-14(12)19-16(13)17/h5-8,11,20H,3-4,9-10H2,1-2H3,(H2,18,19)
n/an/a 9.10E+4n/an/an/an/an/an/a
University of Strathclyde
Curated by ChEMBL
Assay Description
In vitro inhibition of acetylcholinesterase, isolated from rat brain.
J Med Chem 40: 3516-23 (1997)
Article DOI: 10.1021/jm970150t
BindingDB Entry DOI: 10.7270/Q25H7FC9
Acetylcholinesterase
(Homo sapiens (Human))
BDBM50060484
(9-Amino-3-butyl-2-methyl-2,3-dihydro-1H-cyclopenta...)
Show SMILES CCCCC1(O)C(C)Cc2c1nc1ccccc1c2N
Show InChI InChI=1S/C17H22N2O/c1-3-4-9-17(20)11(2)10-13-15(18)12-7-5-6-8-14(12)19-16(13)17/h5-8,11,20H,3-4,9-10H2,1-2H3,(H2,18,19)
NCI pathway
Reactome pathway
n/an/a 9.10E+4n/an/an/an/an/an/a
Sichuan University
Curated by ChEMBL
Assay Description
Inhibition of AChE
Eur J Med Chem 45: 1167-72 (2010)
Article DOI: 10.1016/j.ejmech.2009.12.038
BindingDB Entry DOI: 10.7270/Q25H7GFM
Cholinesterases
(Homo sapiens (Human))
BDBM50060484
(9-Amino-3-butyl-2-methyl-2,3-dihydro-1H-cyclopenta...)
Show SMILES CCCCC1(O)C(C)Cc2c1nc1ccccc1c2N
Show InChI InChI=1S/C17H22N2O/c1-3-4-9-17(20)11(2)10-13-15(18)12-7-5-6-8-14(12)19-16(13)17/h5-8,11,20H,3-4,9-10H2,1-2H3,(H2,18,19)
Reactome pathway
n/an/a 8.10E+4n/an/an/an/an/an/a
University of Strathclyde
Curated by ChEMBL
Assay Description
In vitro inhibition of Butyrylcholinesterase from human plasma.
J Med Chem 40: 3516-23 (1997)
Article DOI: 10.1021/jm970150t
BindingDB Entry DOI: 10.7270/Q25H7FC9
Sodium-dependent serotonin transporter
(Rattus norvegicus (rat))
BDBM50060484
(9-Amino-3-butyl-2-methyl-2,3-dihydro-1H-cyclopenta...)
Show SMILES CCCCC1(O)C(C)Cc2c1nc1ccccc1c2N
Show InChI InChI=1S/C17H22N2O/c1-3-4-9-17(20)11(2)10-13-15(18)12-7-5-6-8-14(12)19-16(13)17/h5-8,11,20H,3-4,9-10H2,1-2H3,(H2,18,19)
n/an/a 7.10E+3n/an/an/an/an/an/a
University of Strathclyde
Curated by ChEMBL
Assay Description
Inhibition of neuronal uptake of 5 - Hydroxytryptamine in rat brain homogenate
J Med Chem 40: 3516-23 (1997)
Article DOI: 10.1021/jm970150t
BindingDB Entry DOI: 10.7270/Q25H7FC9